{"text_format":"1","workbook":"xlsx","n_sheets":19,"sheets":["Start Here","Takt Elements","Work Density","Norm Calculator","Buyout & Procurement Log","Full Norm - Example","VBA Macros Instructions ","WWP (Automatic)","6WLA (Automatic)","Logistics Plan","6WLA (Manual)","WWP-One Floor (Manual)","Roadblocks","Day Plan (Manual)","Crew Board","KPIs","Scrum Board","One Floor Norm Example","Legend"],"not_rendered":{"charts":4,"images":47,"macros":1,"external_links":0,"defined_names":501,"comments":0,"pivot_tables":0},"unopened":[],"bounds":{"document_bytes":16777216,"sheet_cells":100000,"rows_first":2000,"rows_last":500,"rows_between":2000,"halvings":0,"cell_chars":16384,"cell_head_chars":4096},"cells_cut":0,"cells_raw":0,"read":"whole","date_system":"1900"}

{"sheet":"Start Here","index":0,"n_rows":0,"n_cols":0,"rows_kept":0,"cut":false,"hidden":false,"merged":[]}

{"sheet":"Takt Elements","index":1,"n_rows":85,"n_cols":105,"rows_kept":85,"cut":false,"hidden":false,"merged":[]}
[]
[]
[]
[]
[]
[]
[]
[]
[]
["Project Name"]
[2024,null,null,null,null,null,null,null,null,null,null,null,null,null,null,null,null,null,null,null,null,null,null,null,null,null,null,null,null,null,null,null,null,null,null,null,null,null,null,null,null,null,null,null,null,null,null,null,null,null,null,null,null,2025]
["Cold Winter Months",null,null,null,null,null,null,null,null,null,null,null,null,null,null,null,null,null,null,null,null,null,null,null,null,null,null,null,null,null,null,null,null,null,null,null,null,null,null,null,null,null,null,null,"Cold Winter Months",null,null,null,null,null,null,null,null,null,null,null,null,null,null,null,null,null,null,null,null,null,null,null,null,null,null,null,null,null,null,null,null,null,null,null,null,null,null,null,null,null,null,null,null,null,null,null,null,null,null,null,"Cold Winter Months"]
["JANUARY",null,null,null,null,"FEBRUARY",null,null,null,"MARCH",null,null,null,"APRIL",null,null,null,null,"MAY",null,null,null,"JUNE",null,null,null,"JULY",null,null,null,null,"AUGUST",null,null,null,"SEPTEMBER",null,null,null,null,"OCTOBER",null,null,null,"NOVEMBER",null,null,null,"DECEMBER",null,null,null,null,"JANUARY",null,null,null,"FEBRUARY",null,null,null,"MARCH",null,null,null,null,"APRIL",null,null,null,"MAY",null,null,null,"JUNE",null,null,null,null,"JULY",null,null,null,"AUGUST",null,null,null,"SEPTEMBER",null,null,null,null,"OCTOBER",null,null,null,"NOVEMBER",null,null,null,"DECEMBER"]
["2024-01-01","2024-01-08","2024-01-15","2024-01-22","2024-01-29","2024-02-05","2024-02-12","2024-02-19","2024-02-26","2024-03-04","2024-03-11","2024-03-18","2024-03-25","2024-04-01","2024-04-08","2024-04-15","2024-04-22","2024-04-29","2024-05-06","2024-05-13","2024-05-20","2024-05-27","2024-06-03","2024-06-10","2024-06-17","2024-06-24","2024-07-01","2024-07-08","2024-07-15","2024-07-22","2024-07-29","2024-08-05","2024-08-12","2024-08-19","2024-08-26","2024-09-02","2024-09-09","2024-09-16","2024-09-23","2024-09-30","2024-10-07","2024-10-14","2024-10-21","2024-10-28","2024-11-04","2024-11-11","2024-11-18","2024-11-25","2024-12-02","2024-12-09","2024-12-16","2024-12-23","2024-12-30","2025-01-06","2025-01-13","2025-01-20","2025-01-27","2025-02-03","2025-02-10","2025-02-17","2025-02-24","2025-03-03","2025-03-10","2025-03-17","2025-03-24","2025-03-31","2025-04-07","2025-04-14","2025-04-21","2025-04-28","2025-05-05","2025-05-12","2025-05-19","2025-05-26","2025-06-02","2025-06-09","2025-06-16","2025-06-23","2025-06-30","2025-07-07","2025-07-14","2025-07-21","2025-07-28","2025-08-04","2025-08-11","2025-08-18","2025-08-25","2025-09-01","2025-09-08","2025-09-15","2025-09-22","2025-09-29","2025-10-06","2025-10-13","2025-10-20","2025-10-27","2025-11-03","2025-11-10","2025-11-17","2025-11-24","2025-12-01","2025-12-08","2025-12-15","2025-12-22","2025-12-29"]
[]
[]
[]
[]
[]
[]
[]
[null,null,null,null,null,null,null,null,null,null,null,null,null,null,null,null,null,null,null,null,null,null,null,null,null,null,null,null,null,null,null,null,null,null,null,null,null,null,null,null,null,null,null,null,null,null,null,null,null,null,null,null,null,null,null,null,null,null,null,null,null,null,null,null,null,null,null,null,null,null,null,null,"INTERIORS LEGEND"]
[]
[null,null,null,null,null,null,null,null,null,null,null,null,null,null,null,null,null,null,null,null,null,null,null,null,null,null,null,null,null,null,null,null,null,null,null,null,null,null,null,null,null,null,null,"SOIL DISTURBANCE PERMIT",null,null,null,null,null,null,null,null,null,null,null,null,null,null,null,null,null,null,null,null,null,null,null,null,null,null,null,null,null,1,"  Wall Layout + Top Track  "]
[null,null,null,null,null,null,null,null,null,null,null,null,null,null,null,null,null,null,null,null,null,null,null,null,null,null,null,null,null,null,null,null,null,null,null,null,null,null,null,null,null,null,null,null,null,null,"MAKE SAFE UTILITIES",null,null,null,null,null,null,null,null,null,null,null,null,null,null,null,null,null,null,null,null,null,null,null,null,null,null,2,"  Fire Sprinkler + Priority Walls  "]
[null,null,null,null,null,null,null,null,null,null,null,null,null,null,null,null,null,null,null,null,null,null,null,null,null,null,null,null,null,null,null,null,null,null,null,null,null,null,null,null,null,null,null,null,null,null,null,null,"MOBILIZATION",null,null,null,null,null,null,null,null,null,null,null,null,null,null,null,null,null,null,null,null,null,null,null,null,3,"  OH Ductwork"]
[null,null,null,null,null,null,null,null,null,null,null,null,null,null,null,null,null,null,null,null,null,null,null,null,null,null,null,null,null,null,null,null,null,null,null,null,null,null,null,null,null,null,null,null,null,null,null,null,null,null,"EXCAVATION",null,null,null,null,null,"BIM LEGEND",null,null,null,null,null,null,null,null,null,null,null,null,null,null,null,null,4,"  OH Branch Conduits and Lighting"]
[null,null,null,null,null,null,null,null,null,null,null,null,null,null,null,null,null,null,null,null,null,null,null,null,null,null,null,null,null,null,null,null,null,null,null,null,null,null,null,null,null,null,null,null,null,null,null,null,null,null,null,"SHORING",null,null,null,null,null,"Model Coordination",null,null,null,null,null,null,null,null,null,null,null,null,null,null,null,5,"  OH Mechanical Piping"]
[null,null,null,null,null,null,null,null,null,null,null,null,null,null,null,null,null,null,null,null,null,null,null,null,null,null,null,null,null,null,null,null,null,null,null,null,null,null,null,null,null,null,null,null,null,null,null,null,null,null,null,null,null,"PIERS",null,null,null,"Prepare Shop Drawings + Layout Drawings",null,null,null,null,null,null,null,null,null,null,null,null,null,null,null,6,"  OH Electrical  "]
[null,null,null,null,null,null,null,null,null,null,null,null,null,null,null,null,null,null,null,null,null,null,null,null,null,null,null,null,null,null,null,null,null,null,null,null,null,null,null,null,null,null,null,null,null,null,null,null,null,null,null,null,null,null,null,null,null,"Shop Drawing Approval",null,null,null,null,null,null,null,null,null,null,null,null,null,null,null,7,"  Wall Framing  "]
[null,null,null,null,null,null,null,null,null,null,null,null,null,null,null,null,null,null,null,null,null,null,null,null,null,null,null,null,null,null,null,null,null,null,null,null,null,null,null,null,null,null,"UG BIM Coordination",null,null,null,null,null,null,null,null,null,null,null,null,null,null,"Prefabrication of Material",null,null,null,null,null,null,null,null,null,null,null,null,null,null,null,8,"  In wall Rough-in  "]
[null,null,null,null,null,null,null,null,null,null,null,null,null,null,null,null,null,null,null,null,null,null,null,null,null,null,null,null,null,null,null,null,null,null,null,null,null,null,null,null,null,null,null,null,null,null,null,null,null,null,null,null,null,null,null,null,null,null,null,null,null,null,null,null,null,null,null,null,null,null,null,null,null,9,"  Soffits + Ceilings  "]
[null,null,null,null,null,null,null,null,null,null,null,null,null,null,null,null,null,null,null,null,null,null,null,null,null,null,null,null,null,null,null,null,null,null,null,null,null,null,null,"Shaft Prep",null,null,null,null,null,null,null,null,null,null,null,null,null,null,null,null,null,null,null,null,null,null,null,null,null,null,null,null,null,null,null,null,null,10,"  Soffit & Ceiling Rough  "]
[null,null,null,null,null,null,null,null,null,null,null,null,null,null,null,null,null,null,null,null,null,null,null,null,null,null,null,null,null,null,null,null,null,null,null,null,null,null,null,null,null,null,null,"Elevator Cabs",null,null,null,null,null,null,null,null,null,null,null,null,null,null,null,null,null,null,null,null,null,null,null,null,null,null,null,null,null,11,"  Drywall  "]
[null,null,null,null,null,null,null,null,null,null,null,null,null,null,null,null,null,null,null,null,null,null,null,null,null,null,null,null,null,null,null,null,null,null,null,null,null,null,null,null,null,null,null,null,null,null,null,null,null,null,null,null,null,null,null,null,null,"Test + Certification",null,null,null,null,null,null,null,null,null,null,null,null,null,null,null,12,"  Taping  "]
[null,null,null,null,null,null,null,null,null,null,null,null,null,null,null,null,null,null,null,null,null,null,null,null,null,null,null,null,null,null,null,null,null,null,null,null,null,null,null,"Erect Stair",null,null,null,null,null,null,null,null,null,null,null,null,null,null,null,null,null,null,null,null,null,null,null,null,null,null,null,null,null,null,null,null,null,13,"  Prime + First Coat"]
[null,null,null,null,null,null,null,null,null,null,null,null,null,null,null,null,null,null,null,null,null,null,null,null,null,null,null,null,null,null,null,null,null,null,null,null,null,null,null,null,null,null,null,"Pour Stair Pans",null,null,null,null,null,null,null,null,null,null,null,null,null,null,null,null,null,null,null,null,null,null,null,null,null,null,null,null,null,14,"  Data Cabling"]
[null,null,null,null,null,null,null,null,null,null,null,null,null,null,null,null,null,null,null,null,null,null,null,null,null,null,null,null,null,null,null,null,null,null,null,null,null,null,null,null,null,null,null,null,null,null,null,null,null,null,null,null,null,null,null,null,null,null,null,null,null,null,null,null,null,null,null,null,null,null,null,null,null,15,"  Ceiling Grid  "]
[null,null,null,null,null,null,null,null,null,null,null,null,null,null,null,null,null,null,null,null,null,null,null,null,null,null,null,null,null,null,null,null,null,null,null,null,null,null,null,null,null,"Temp Roof",null,null,null,null,"Install Swing Stages",null,null,null,null,null,null,null,null,null,null,null,null,null,null,null,null,null,null,null,null,null,null,null,null,null,null,16,"  Casework + Doors  "]
[null,null,null,null,null,null,null,null,null,null,null,null,null,null,null,null,null,null,null,null,null,null,null,null,null,null,null,null,null,null,null,null,null,null,null,null,null,null,null,null,null,null,null,null,null,null,null,null,null,null,"Set AHU & Install",null,null,null,null,null,null,null,null,null,null,null,null,null,null,null,null,null,null,null,null,null,null,17,"  MEP Trim / Light and Devices"]
[null,null,null,null,null,null,null,null,null,null,null,null,null,null,null,null,null,null,null,null,null,null,null,null,null,null,null,null,null,null,null,null,null,null,null,null,null,null,null,null,null,null,null,null,null,null,null,null,null,null,null,null,null,null,null,"Roofing ",null,null,null,null,null,null,null,null,null,null,null,null,null,null,null,null,null,18,"  Flooring + Baseboards"]
[null,null,null,null,null,null,null,null,null,null,null,null,null,null,null,null,null,null,null,null,null,null,null,null,null,null,null,null,null,null,null,null,null,null,null,null,null,null,null,null,null,null,null,null,null,null,null,null,null,null,null,null,null,null,null,null,null,null,null,null,null,null,null,null,null,null,null,null,null,null,null,null,null,19,"  Final Paint"]
[null,null,null,null,null,null,null,null,null,null,null,null,null,null,null,null,null,null,null,null,null,null,null,null,null,null,null,null,null,null,null,null,null,null,null,null,null,null,null,null,null,null,null,null,null,null,null,null,null,null,null,null,null,null,null,null,null,null,null,null,null,null,null,null,null,null,null,null,null,null,null,null,null,20,"  Final Accessories"]
[null,null,null,null,null,null,null,null,null,null,null,null,null,null,null,null,null,null,null,null,null,null,null,null,null,null,null,null,null,null,null,null,null,null,null,null,null,null,null,null,null,null,null,null,null,null,1,2,3,4,5,6,7,8,9,10,11,12,13,14,15,16,17,18,19,20,21,22,null,null,null,null,null,21,"  Pre-Punch & Clean"]
[null,null,null,null,null,null,null,null,null,null,null,null,null,null,null,null,null,null,null,null,null,null,null,null,null,null,null,null,null,null,null,null,null,null,null,null,null,null,null,null,null,null,null,null,null,null,null,null,null,null,null,null,null,null,null,null,null,null,null,null,null,null,null,null,null,null,null,null,null,null,null,null,null,22,"  Punchlist  "]
[]
[]
[]
[]
[]
[]
[]
[]
[]
[]
[]
[]
[]
[]
[]
[]
[]
[]
[null,null,null,null,null,null,null,null,null,null,null,null,null,null,null,null,null,null,null,null,null,null,null,null,null,null,null,null,null,null,null,null,null,null,null,null,null,null,null,null,null,null,null,null,null,null,null,null,null,null,null,null,null,null,null,null,null,null,null,null,null,null,null,null,null,null,null,null,null,null,null,null,null,null,null,null,null,null,"More colors"]
[null,null,null,null,null,null,null,null,null,1,2,3,4,5,6,7,8,9,10,11,12,13,null,null,null,null,null,null,null,null,null,null,null,null,null,null,null,1,2,3,4,5,6,null,null,null,null,null,null,null,null,7,8,9,10,11,12,null,null,null,null,null,null,null,null,13,14,"B",15,16,"PI"]
[null,null,null,null,null,null,null,null,null,null,1,2,3,4,5,6,7,8,9,10,11,12,13,null,null,null,null,null,null,null,null,null,null,null,null,null,null,null,1,2,3,4,5,6,null,null,null,null,null,null,null,null,7,8,9,10,11,12,null,null,null,null,null,null,null,null,13,14,"IR",15,16,"PI"]
[null,null,null,null,null,null,null,null,null,null,null,1,2,3,4,5,6,7,8,9,10,11,12,13,null,null,null,null,null,null,null,null,null,null,null,null,null,null,null,1,2,3,4,5,6,null,null,null,null,null,null,null,null,7,8,9,10,11,12,null,null,null,null,"B",null,null,null,13,14,"IR","B",16,"PI"]
[null,null,null,null,null,null,null,null,null,null,null,null,1,2,3,4,5,6,7,8,9,10,11,12,13,null,null,null,null,null,null,null,null,null,null,null,null,null,null,null,1,2,3,4,5,6,null,null,null,null,null,null,null,null,7,8,9,10,11,12,null,null,null,null,null,null,null,null,13,14,"IR",15,16,"PI"]
[null,null,null,null,null,null,null,null,null,null,null,null,null,1,2,3,4,5,6,7,8,9,10,11,12,13,null,null,null,null,null,null,null,null,null,null,null,null,null,null,null,1,2,3,4,5,6,null,null,null,null,null,null,null,null,7,8,9,10,11,12,null,null,null,null,null,null,null,null,13,14,"IR",15,16,"PI"]
[null,null,null,null,null,null,null,null,null,null,null,null,null,null,1,2,3,4,5,6,7,8,9,10,11,12,13,null,null,null,null,null,null,null,null,null,null,null,null,null,null,null,1,2,3,4,5,6,null,null,null,null,null,null,null,null,7,8,9,10,11,12,null,null,null,null,null,null,null,null,13,14,"IR",15,16,"PI"]
[null,null,null,null,null,null,null,null,null,null,null,null,null,null,null,1,2,3,4,5,6,7,8,9,10,11,12,13]
[null,null,null,null,null,null,null,null,null,null,null,null,null,null,null,null,1,2,3,4,5,6,7,8,9,10,11,12,13]
[null,null,null,null,null,null,null,null,null,null,null,null,null,null,null,null,null,1,2,3,4,5,6,7,8,9,10,11,12,13,null,null,null,null,null,null,null,1,2,3,4,5,null,null,null,null,null,null,null,null,null,6,7,8,9,10,null,null,null,null,null,null,null,null,null,11,12,13,14,15]
[null,null,null,null,null,null,null,null,null,null,null,null,null,null,null,null,null,null,null,null,null,null,null,null,null,null,null,null,null,null,null,null,null,null,null,null,null,null,1,2,3,4,5,null,null,null,null,null,null,null,null,null,6,7,8,9,10,null,null,null,null,null,null,null,null,null,11,12,13,14,15]
[null,null,null,null,null,null,null,null,null,null,null,null,null,null,null,null,null,null,null,null,null,null,null,null,null,null,null,null,null,null,null,null,null,null,null,null,null,null,null,1,2,3,4,5,null,null,null,null,null,null,null,null,null,6,7,8,9,10,null,null,null,null,null,null,null,null,null,11,12,13,14,15]
[null,null,null,null,null,null,null,null,null,null,null,null,null,null,null,null,null,null,null,null,null,null,null,null,null,null,null,null,null,null,null,null,null,null,null,null,null,null,null,null,1,2,3,4,5,null,null,null,null,null,null,null,null,null,6,7,8,9,10,null,null,null,null,null,null,null,null,null,11,12,13,14,15]
[null,null,null,null,null,null,null,null,null,null,null,null,null,null,null,null,null,null,null,null,null,null,null,null,null,null,null,null,null,null,null,null,null,null,null,null,null,null,null,null,null,1,2,3,4,5,null,null,null,null,null,null,null,null,null,6,7,8,9,10,null,null,null,null,null,null,null,null,null,11,12,13,14,15]
[]
[]
[null,null,null,null,null,null,null,null,null,1,2,3,4,5,6,null,null,null,null,null,null,null,null,"A","B","C","D","E","F"]
[null,null,null,null,null,null,null,null,null,null,1,2,3,4,5,6,null,null,null,null,null,null,null,null,"A","B","C","D","E","F"]
[null,null,null,null,null,null,null,null,null,null,null,1,2,3,4,5,6,null,null,null,null,null,null,null,null,"A","B","C","D","E","F"]
[null,null,null,null,null,null,null,null,null,null,null,null,1,2,3,4,5,6,null,null,null,null,null,null,null,null,"A","B","C","D","E","F"]
[null,null,null,null,null,null,null,null,null,null,null,null,null,1,2,3,4,5,6,null,null,null,null,null,null,null,null,"A","B","C","D","E","F"]
[null,null,null,null,null,null,null,null,null,null,null,null,null,null,1,2,3,4,5,6,null,null,null,null,null,null,null,null,"A","B","C","D","E","F"]

{"sheet":"Work Density","index":2,"n_rows":95,"n_cols":130,"rows_kept":95,"cut":false,"hidden":false,"merged":[[92,10,92,12],[92,13,92,15],[93,10,93,12],[93,13,93,15],[94,10,94,12],[94,13,94,15],[89,10,89,12],[89,13,89,15],[90,10,90,12],[90,13,90,15],[91,10,91,12],[91,13,91,15],[86,10,86,12],[86,13,86,15],[87,10,87,12],[87,13,87,15],[88,10,88,12],[88,13,88,15],[85,10,85,12],[85,13,85,15],[72,10,72,12],[72,13,72,15],[73,10,73,12],[73,13,73,15],[74,10,74,12],[74,13,74,15],[81,10,82,15],[83,10,83,12],[83,13,83,15],[84,10,84,12],[84,13,84,15],[69,10,69,12],[69,13,69,15],[70,10,70,12],[70,13,70,15],[71,10,71,12],[71,13,71,15],[66,10,66,12],[66,13,66,15],[67,10,67,12],[67,13,67,15],[68,10,68,12],[68,13,68,15],[65,10,65,12],[65,13,65,15],[17,126,17,128],[17,129,17,131],[18,126,18,128],[18,129,18,131],[19,126,19,128],[19,129,19,131],[61,10,62,15],[63,10,63,12],[63,13,63,15],[64,10,64,12],[64,13,64,15],[14,126,14,128],[14,129,14,131],[15,126,15,128],[15,129,15,131],[16,126,16,128],[16,129,16,131],[11,126,11,128],[11,129,11,131],[12,126,12,128],[12,129,12,131],[13,126,13,128],[13,129,13,131],[10,126,10,128],[10,129,10,131],[6,126,7,131],[8,126,8,128],[8,129,8,131],[9,126,9,128],[9,129,9,131]]}
[]
[]
[]
[]
[]
[]
[null,null,null,null,null,null,null,null,null,null,null,null,null,null,null,null,null,null,null,null,null,null,null,null,null,null,null,null,null,null,null,null,null,null,null,null,null,null,null,null,null,null,null,null,null,null,null,null,null,null,null,null,null,null,null,null,null,null,null,null,null,null,null,null,null,null,null,null,null,null,null,null,null,null,null,null,null,null,null,null,null,null,null,null,null,null,null,null,null,null,null,null,null,null,null,null,null,null,null,null,null,null,null,null,null,null,null,null,null,null,null,null,null,null,null,null,null,null,null,null,null,null,null,null,null,null,"Work Density Table"]
[]
[null,null,null,null,null,null,null,null,null,null,null,null,null,null,null,null,null,null,null,null,null,null,null,null,null,null,null,null,null,null,null,null,null,null,null,null,null,null,null,null,null,null,null,null,null,null,null,null,null,null,null,null,null,null,null,null,null,null,null,null,null,null,null,null,null,null,null,null,null,null,null,null,null,null,null,null,null,null,null,null,null,null,null,null,null,null,null,null,null,null,null,null,null,null,null,null,null,null,null,null,null,null,null,null,null,null,null,null,null,null,null,null,null,null,null,null,null,null,null,null,null,null,null,null,null,null,"Zone",null,null,"Density"]
[null,null,null,null,null,null,null,null,null,null,null,null,null,null,null,null,null,null,null,null,null,null,null,null,null,null,null,null,null,null,null,null,null,null,null,null,null,null,null,null,null,null,null,null,null,null,null,null,null,null,null,null,null,null,null,null,null,null,null,null,null,null,null,null,null,null,null,null,null,null,null,null,null,null,null,null,null,null,null,null,null,null,null,null,null,null,null,null,null,null,null,null,null,null,null,null,null,null,null,null,null,null,null,null,null,null,null,null,null,null,null,null,null,null,null,null,null,null,null,null,null,null,null,null,null,null,1,null,null,{"$f":"+SUM(FC16:FD17,FA16:FB19)","v":0}]
[null,null,null,null,null,null,null,null,null,null,null,null,null,null,null,null,null,null,null,null,null,null,null,null,null,null,null,null,null,null,null,null,null,null,null,null,null,null,null,null,null,null,null,null,null,null,null,null,null,null,null,null,null,null,null,null,null,null,null,null,null,null,null,null,null,null,null,null,null,null,null,null,null,null,null,null,null,null,null,null,null,null,null,null,null,null,null,null,null,null,null,null,null,null,null,null,null,null,null,null,null,null,null,null,null,null,null,null,null,null,null,null,null,null,null,null,null,null,null,null,null,null,null,null,null,null,2,null,null,{"$f":"+SUM(FA11:FD15)","v":0}]
[null,null,null,null,null,null,null,null,null,null,null,null,null,null,null,null,null,null,null,null,null,null,null,null,null,null,null,null,null,null,null,null,null,null,null,null,null,null,null,null,null,null,null,null,null,null,null,null,null,null,null,null,null,null,null,null,null,null,null,null,null,null,null,null,null,null,null,null,null,null,null,null,null,null,null,null,null,null,null,null,null,null,null,null,null,null,null,null,null,null,null,null,null,null,null,null,null,null,null,null,null,null,null,null,null,null,null,null,null,null,null,null,null,null,null,null,null,null,null,null,null,null,null,null,null,null,3,null,null,{"$f":"+SUM(EW11:EZ15)","v":0}]
[null,null,null,null,null,null,null,null,null,null,null,null,null,null,null,null,null,null,null,null,null,null,null,null,null,null,null,null,null,null,null,null,null,null,null,null,null,null,null,null,null,null,null,null,null,null,null,null,null,null,null,null,null,null,null,null,null,null,null,null,null,null,null,null,null,null,null,null,null,null,null,null,null,null,null,null,null,null,null,null,null,null,null,null,null,null,null,null,null,null,null,null,null,null,null,null,null,null,null,null,null,null,null,null,null,null,null,null,null,null,null,null,null,null,null,null,null,null,null,null,null,null,null,null,null,null,4,null,null,{"$f":"+SUM(EW16:EZ19)","v":0}]
[null,null,null,null,null,null,null,null,null,null,null,null,null,null,null,null,null,null,null,null,null,null,null,null,null,null,null,null,null,null,null,null,null,null,null,null,null,null,null,null,null,null,null,null,null,null,null,null,null,null,null,null,null,null,null,null,null,null,null,null,null,null,null,null,null,null,null,null,null,null,null,null,null,null,null,null,null,null,null,null,null,null,null,null,null,null,null,null,null,null,null,null,null,null,null,null,null,null,null,null,null,null,null,null,null,null,null,null,null,null,null,null,null,null,null,null,null,null,null,null,null,null,null,null,null,null,5,null,null,{"$f":"+SUM(ES16:EV19)","v":0}]
[null,null,null,null,null,null,null,null,null,null,null,null,null,null,null,null,null,null,null,null,null,null,null,null,null,null,null,null,null,null,null,null,null,null,null,null,null,null,null,null,null,null,null,null,null,null,null,null,null,null,null,null,null,null,null,null,null,null,null,null,null,null,null,null,null,null,null,null,null,null,null,null,null,null,null,null,null,null,null,null,null,null,null,null,null,null,null,null,null,null,null,null,null,null,null,null,null,null,null,null,null,null,null,null,null,null,null,null,null,null,null,null,null,null,null,null,null,null,null,null,null,null,null,null,null,null,6,null,null,{"$f":"+SUM(ES11:EV15)","v":0}]
[null,null,null,null,null,null,null,null,null,null,null,null,null,null,null,null,null,null,null,null,null,null,null,null,null,null,null,null,null,null,null,null,null,null,null,null,null,null,null,null,null,null,null,null,null,null,null,null,null,null,null,null,null,null,null,null,null,null,null,null,null,null,null,null,null,null,null,null,null,null,null,null,null,null,null,null,null,null,null,null,null,null,null,null,null,null,null,null,null,null,null,null,null,null,null,null,null,null,null,null,null,null,null,null,null,null,null,null,null,null,null,null,null,null,null,null,null,null,null,null,null,null,null,null,null,null,7,null,null,{"$f":"+SUM(EO11:ER15)","v":0}]
[null,null,null,null,null,null,null,null,null,null,null,null,null,null,null,null,null,null,null,null,null,null,null,null,null,null,null,null,null,null,null,null,null,null,null,null,null,null,null,null,null,null,null,null,null,null,null,null,null,null,null,null,null,null,null,null,null,null,null,null,null,null,null,null,null,null,null,null,null,null,null,null,null,null,null,null,null,null,null,null,null,null,null,null,null,null,null,null,null,null,null,null,null,null,null,null,null,null,null,null,null,null,null,null,null,null,null,null,null,null,null,null,null,null,null,null,null,null,null,null,null,null,null,null,null,null,8,null,null,{"$f":"+SUM(EO16:ER19)","v":0}]
[null,null,null,null,null,null,null,null,null,null,null,null,null,null,null,null,null,null,null,null,null,null,null,null,null,null,null,null,null,null,null,null,null,null,null,null,null,null,null,null,null,null,null,null,null,null,null,null,null,null,null,null,null,null,null,null,null,null,null,null,null,null,null,null,null,null,null,null,null,null,null,null,null,null,null,null,null,null,null,null,null,null,null,null,null,null,null,null,null,null,null,null,null,null,null,null,null,null,null,null,null,null,null,null,null,null,null,null,null,null,null,null,null,null,null,null,null,null,null,null,null,null,null,null,null,null,9,null,null,{"$f":"+SUM(EL7:EN19)","v":0}]
[null,null,null,null,null,null,null,null,null,null,null,null,null,null,null,null,null,null,null,null,null,null,null,null,null,null,null,null,null,null,null,null,null,null,null,null,null,null,null,null,null,null,null,null,null,null,null,null,null,null,null,null,null,null,null,null,null,null,null,null,null,null,null,null,null,null,null,null,null,null,null,null,null,null,null,null,null,null,null,null,null,null,null,null,null,null,null,null,null,null,null,null,null,null,null,null,null,null,null,null,null,null,null,null,null,null,null,null,null,null,null,null,null,null,null,null,null,null,null,null,null,null,null,null,null,null,10,null,null,{"$f":"+SUM(EI7:EK19)","v":0}]
[null,null,null,null,null,null,null,null,null,null,null,null,null,null,null,null,null,null,null,null,null,null,null,null,null,null,null,null,null,null,null,null,null,null,null,null,null,null,null,null,null,null,null,null,null,null,null,null,null,null,null,null,null,null,null,null,null,null,null,null,null,null,null,null,null,null,null,null,null,null,null,null,null,null,null,null,null,null,null,null,null,null,null,null,null,null,null,null,null,null,null,null,null,null,null,null,null,null,null,null,null,null,null,null,null,null,null,null,null,null,null,null,null,null,null,null,null,null,null,null,null,null,null,null,null,null,11,null,null,{"$f":"+SUM(EE11:EH19,EF7:EH10)","v":0}]
[]
[]
[null,null,null,"Creating & populating grid according to our scale"]
[]
[]
[]
[]
[]
[]
[]
[]
[]
[]
[]
[]
[]
[]
[]
[]
[]
[]
[null,null,null,null,null,null,null,null,null,null,null,null,null,null,null,null,null,null,0,0,0,0,0,0,0,0,0,0]
[null,null,null,null,null,null,null,null,null,null,null,null,null,null,null,null,null,null,0,3,3,3,3,3,3,3,3,3]
[null,null,null,null,null,null,null,null,null,null,null,null,null,null,null,null,null,null,0,3,3,3,3,3,3,3,3,3]
[null,null,null,null,null,null,null,null,null,null,null,null,null,null,null,null,null,null,0,3,3,3,3,3,3,3,3,3]
[null,null,null,null,null,null,null,null,null,null,null,null,null,null,null,null,null,null,0,3,4,4,6,6,6,3,3,3]
[null,null,null,null,null,null,null,null,null,null,null,null,null,null,null,null,null,null,3,3,6,4,6,6,6,3,3,3,8,8,8,8,8,8,8,8,8,8,8,8,8,8,8,8]
[null,null,null,null,null,null,null,null,null,null,null,null,null,null,null,null,null,null,3,3,6,4,6,6,6,3,3,3,8,8,8,8,8,8,8,8,8,8,8,8,8,8,8,8]
[null,null,null,null,null,null,null,null,null,null,null,null,null,null,null,null,null,null,3,3,6,4,7,7,7,7,3,3,8,8,8,8,8,8,8,8,8,8,8,8,8,8,8,8]
[null,null,null,null,null,null,null,null,null,null,null,null,null,null,null,null,null,null,3,3,6,4,7,7,7,9,9,9,8,8,8,8,8,8,8,8,8,8,8,8,8,8,8,8]
[null,null,null,null,null,null,null,null,null,null,null,null,null,null,null,null,null,null,3,3,4,4,7,7,7,9,9,9,8,8,8,8,8,8,8,8,8,7,8,8,8,8,8,8]
[null,null,null,null,null,null,null,null,null,null,null,null,null,null,null,null,null,null,3,3,4,4,7,7,7,9,9,9,8,8,8,8,8,8,8,8,8,7,7,8,8,8,8,8]
[null,null,null,null,null,null,null,null,null,null,null,null,null,null,null,null,null,null,3,4,4,4,4,4,4,4,9,9,8,8,8,8,8,8,8,8,8,7,7,7,7,7,8,8]
[null,null,null,null,null,null,null,null,null,null,null,null,null,null,null,null,null,null,2,8,8,8,4,4,4,4,8,8,7,7,7,7,7,7,7,7,7,7,7,7,7,7]
[null,null,null,null,null,null,null,null,null,null,null,null,null,null,null,null,null,null,2,8,8,8,4,4,4,4,4,4,4,4,4,4,4,4,4,4,4,4,4,4,4,4]
[]
[]
[null,null,null,"Work density with initial zoning (aggregate scores)"]
[]
[]
[]
[null,null,null,null,null,null,null,null,null,null,"Work Density Table",null,null,null,null,null,null,null,null,null,null,null,null,null,0,0,0,0,0,0,0,0,0,0]
[null,null,null,null,null,null,null,null,null,null,null,null,null,null,null,null,null,null,null,null,null,null,null,null,0,3,3,3,3,3,3,3,3,3]
[null,null,null,null,null,null,null,null,null,null,"Zone",null,null,"Density",null,null,null,null,null,null,null,null,null,null,0,3,3,3,3,3,3,3,3,3]
[null,null,null,null,null,null,null,null,null,null,1,null,null,{"$f":"+SUM(AW72:AX73,AU72:AV75)","v":84},null,null,null,null,null,null,null,null,null,null,0,3,3,3,3,3,3,3,3,3]
[null,null,null,null,null,null,null,null,null,null,2,null,null,{"$f":"+SUM(AU67:AX71)","v":160},null,null,null,null,null,null,null,null,null,null,0,3,4,4,6,6,6,3,3,3]
[null,null,null,null,null,null,null,null,null,null,3,null,null,{"$f":"+SUM(AQ67:AT71)","v":159},null,null,null,null,null,null,null,null,null,null,3,3,6,4,6,6,6,3,3,3,8,8,8,8,8,8,8,8,8,8,8,8,8,8,8,8]
[null,null,null,null,null,null,null,null,null,null,4,null,null,{"$f":"+SUM(AQ72:AT75)","v":103},null,null,null,null,null,null,null,null,null,null,3,3,6,4,6,6,6,3,3,3,8,8,8,8,8,8,8,8,8,8,8,8,8,8,8,8]
[null,null,null,null,null,null,null,null,null,null,5,null,null,{"$f":"+SUM(AM72:AP75)","v":108},null,null,null,null,null,null,null,null,null,null,3,3,6,4,7,7,7,7,3,3,8,8,8,8,8,8,8,8,8,8,8,8,8,8,8,8]
[null,null,null,null,null,null,null,null,null,null,6,null,null,{"$f":"+SUM(AM67:AP71)","v":160},null,null,null,null,null,null,null,null,null,null,3,3,6,4,7,7,7,9,9,9,8,8,8,8,8,8,8,8,8,8,8,8,8,8,8,8]
[null,null,null,null,null,null,null,null,null,null,7,null,null,{"$f":"+SUM(AI67:AL71)","v":160},null,null,null,null,null,null,null,null,null,null,3,3,4,4,7,7,7,9,9,9,8,8,8,8,8,8,8,8,8,7,8,8,8,8,8,8]
[null,null,null,null,null,null,null,null,null,null,8,null,null,{"$f":"+SUM(AI72:AL75)","v":108},null,null,null,null,null,null,null,null,null,null,3,3,4,4,7,7,7,9,9,9,8,8,8,8,8,8,8,8,8,7,7,8,8,8,8,8]
[null,null,null,null,null,null,null,null,null,null,9,null,null,{"$f":"+SUM(AF63:AH75)","v":202},null,null,null,null,null,null,null,null,null,null,3,4,4,4,4,4,4,4,9,9,8,8,8,8,8,8,8,8,8,7,7,7,7,7,8,8]
[null,null,null,null,null,null,null,null,null,null,10,null,null,{"$f":"+SUM(AC63:AE75)","v":201},null,null,null,null,null,null,null,null,null,null,2,8,8,8,4,4,4,4,8,8,7,7,7,7,7,7,7,7,7,7,7,7,7,7]
[null,null,null,null,null,null,null,null,null,null,11,null,null,{"$f":"+SUM(Y67:AB75,Z63:AB66)","v":197},null,null,null,null,null,null,null,null,null,null,2,8,8,8,4,4,4,4,4,4,4,4,4,4,4,4,4,4,4,4,4,4,4,4]
[]
[]
[]
[null,null,null,"Adjusing areas for a better density leveling "]
[]
[]
[null,null,null,null,null,null,null,null,null,null,"Work Density Table",null,null,null,null,null,null,null,null,null,null,null,null,0,0,0,0,0,0,0,0,0,0]
[null,null,null,null,null,null,null,null,null,null,null,null,null,null,null,null,null,null,null,null,null,null,null,0,3,3,3,3,3,3,3,3,3]
[null,null,null,null,null,null,null,null,null,null,"Zone",null,null,"Density",null,null,null,null,null,null,null,null,null,0,3,3,3,3,3,3,3,3,3]
[null,null,null,null,null,null,null,null,null,null,1,null,null,{"$f":"+SUM(AS91:AS95,AT91:AW95)","v":150},null,null,null,null,null,null,null,null,null,0,3,3,3,3,3,3,3,3,3]
[null,null,null,null,null,null,null,null,null,null,2,null,null,{"$f":"+SUM(AT87:AW90,AS88:AS90)","v":152},null,null,null,null,null,null,null,null,null,0,3,4,4,6,6,6,3,3,3]
[null,null,null,null,null,null,null,null,null,null,3,null,null,{"$f":"+SUM(AP87:AR91,AS87,AO89:AO91)","v":151},null,null,null,null,null,null,null,null,null,3,3,6,4,6,6,6,3,3,3,8,8,8,8,8,8,8,8,8,8,8,8,8,8,8,8]
[null,null,null,null,null,null,null,null,null,null,4,null,null,{"$f":"+SUM(AN92:AR95,AM92:AM94)","v":154},null,null,null,null,null,null,null,null,null,3,3,6,4,6,6,6,3,3,3,8,8,8,8,8,8,8,8,8,8,8,8,8,8,8,8]
[null,null,null,null,null,null,null,null,null,null,5,null,null,{"$f":"+SUM(AH92:AK95,AL92:AL95,AM95,AG94:AG95)","v":151},null,null,null,null,null,null,null,null,null,3,3,6,4,7,7,7,7,3,3,8,8,8,8,8,8,8,8,8,8,8,8,8,8,8,8]
[null,null,null,null,null,null,null,null,null,null,6,null,null,{"$f":"+SUM(AL87:AN91,AO87:AO88,AK90:AK91)","v":152},null,null,null,null,null,null,null,null,null,3,3,6,4,7,7,7,9,9,9,8,8,8,8,8,8,8,8,8,8,8,8,8,8,8,8]
[null,null,null,null,null,null,null,null,null,null,7,null,null,{"$f":"+SUM(AH87:AJ91,AK87:AK89,AG87:AG88)","v":150},null,null,null,null,null,null,null,null,null,3,3,4,4,7,7,7,9,9,9,8,8,8,8,8,8,8,8,8,7,8,8,8,8,8,8]
[null,null,null,null,null,null,null,null,null,null,8,null,null,{"$f":"+SUM(AE83:AF92,AG83:AG86,AG89:AG93)","v":151},null,null,null,null,null,null,null,null,null,3,3,4,4,7,7,7,9,9,9,8,8,8,8,8,8,8,8,8,7,7,8,8,8,8,8]
[null,null,null,null,null,null,null,null,null,null,9,null,null,{"$f":"+SUM(AB90:AD95,AE93:AF95,AA92:AA95)","v":156},null,null,null,null,null,null,null,null,null,3,4,4,4,4,4,4,4,9,9,8,8,8,8,8,8,8,8,8,7,7,7,7,7,8,8]
[null,null,null,null,null,null,null,null,null,null,10,null,null,{"$f":"+SUM(Y83:AD87,AB88:AD89,,X87)","v":156},null,null,null,null,null,null,null,null,null,2,8,8,8,4,4,4,4,8,8,7,7,7,7,7,7,7,7,7,7,7,7,7,7]
[null,null,null,null,null,null,null,null,null,null,11,null,null,{"$f":"+SUM(X88:Z95,Y83:AA86,AA88:AA91)","v":157},null,null,null,null,null,null,null,null,null,2,8,8,8,4,4,4,4,4,4,4,4,4,4,4,4,4,4,4,4,4,4,4,4]

{"sheet":"Norm Calculator","index":3,"n_rows":86,"n_cols":275,"rows_kept":86,"cut":false,"hidden":false,"merged":[[85,25,85,28],[85,29,85,30],[40,29,40,30],[41,25,41,28],[41,29,41,30],[42,25,42,28],[42,29,42,30],[83,25,83,28],[83,29,83,30],[40,25,40,28],[23,1,24,2],[23,3,24,3],[27,1,28,3],[84,25,84,28],[84,29,84,30],[11,3,12,3],[14,1,15,2],[14,3,15,3],[17,1,18,3],[21,1,22,2],[21,3,22,3],[19,1,20,2],[19,3,20,3],[11,1,12,2],[2,21,3,21],[2,22,3,22],[5,1,6,3],[7,1,8,2],[7,3,8,3],[2,18,3,18],[2,19,3,19],[2,20,3,20],[9,1,10,2],[9,3,10,3],[2,15,3,15],[2,16,3,16],[2,17,3,17],[1,5,1,7],[1,8,1,13],[1,14,1,19],[2,5,3,5],[2,6,3,6],[2,7,3,7],[2,8,3,8],[2,9,3,9],[2,13,3,13],[2,14,3,14]]}
[]
[null,null,null,null,null,"Macro",null,null,"Norm",null,null,null,null,null,"General Information"]
[null,null,null,null,null,"Adjusted Takt Wagons","Adjusted Takt Zones","Fixed Takt Time","Fixed Takt Wagons","Adjusted Takt Zones","Takt Time Unrounded","Theoretical Low Limit","Train Length","Adjusted Takt Time","Takt Level","Duration","SSU per Zone","Trade Time Gained","Area per Zone","Realized Flow Potential","Efficiency Parametric","Value Parametric",36,null,null,1,2,3,4,5,6,7,8,9,10,11,12,13,14,15,16,17,18,19,20,21,22,23,24,25,26,27,28,29,30,31,32,33,34,35,36,37,38,39,40,41,42,43,44,45,46,47,48,49,50,51,52,53,54,55,56,57,58,59,60,61,62,63,64,65,66,67,68,69,70,71,72,73,74,75,76,77,78,79,80,81,82,83,84,85,86,87,88,89,90,91,92,93,94,95,96,97,98,99,100,101,102,103,104,105,106,107,108,109,110,111,112,113,114,115,116,117,118,119,120,121,122,123,124,125,126,127,128,129,130,131,132,133,134,135,136,137,138,139,140,141,142,143,144,145,146,147,148,149,150,151,152,153,154,155,156,157,158,159,160,161,162,163,164,165,166,167,168,169,170,171,172,173,174,175,176,177,178,179,180,181,182,183,184,185,186,187,188,189,190,191,192,193,194,195,196,197,198,199,200,201,202,203,204,205,206,207,208,209,210,211,212,213,214,215,216,217,218,219,220,221,222,223,224,225,226,227,228,229,230,231,232,233,234,235,236,237,238,239,240,241,242,243,244,245,246,247,248,249,250]
[null,null,null,null,null,null,null,null,null,null,null,null,null,null,null,null,null,null,null,null,null,null,null,null,1,{"$f":"IFERROR(\n  _xlfn.LET(\n    _xlpm.val, $D$12 / Z3,\n    _xlpm.n, ROUNDUP(1 / _xlpm.val, 0),\n    IF(_xlpm.n > $D$8, \"\", _xlpm.n)\n  ),\n\"\")","v":1},{"$f":"IFERROR(\n  _xlfn.LET(\n    _xlpm.val, $D$12 / AA3,\n    _xlpm.n, ROUNDUP(1 / _xlpm.val, 0),\n    IF(_xlpm.n > $D$8, \"\", _xlpm.n)\n  ),\n\"\")","v":1},1,1,1,2,2,2,2,2,3,3,3,3,3,4,4,4,4,4,5,5,5,5,5,6,6,6,6,6,7,7,7,7,7,8,8,8,8,8,9,9,9,9,9,10,10,10,10,10,11,11,11,11,11,12,12,12,12,12,13,13,13,13,13,{"$f":"IFERROR(\n  _xlfn.LET(\n    _xlpm.val, $D$12 / CM3,\n    _xlpm.n, ROUNDUP(1 / _xlpm.val, 0),\n    IF(_xlpm.n > $D$8, \"\", _xlpm.n)\n  ),\n\"\")","v":14},14,14,14,14,15,15,15,15,15,"","","","","","","","","","","","","","","","","","","","","","","","","","","","","","","","","","","","","","","","","","","","","","","","","","","","","","",{"$f":"IFERROR(\n  _xlfn.LET(\n    _xlpm.val, $D$12 / EY3,\n    _xlpm.n, ROUNDUP(1 / _xlpm.val, 0),\n    IF(_xlpm.n > $D$8, \"\", _xlpm.n)\n  ),\n\"\")","v":""},"","","","","","","","","","","","","","","","","","","","","","","","","","","","","","","","","","","","","","","","","","","","","","","","","","","","","","","","","","","","","","","",{"$f":"IFERROR(\n  _xlfn.LET(\n    _xlpm.val, $D$12 / HK3,\n    _xlpm.n, ROUNDUP(1 / _xlpm.val, 0),\n    IF(_xlpm.n > $D$8, \"\", _xlpm.n)\n  ),\n\"\")","v":""},"","","","","","","","","","","","","","","","","","","","","","","","","","","","","","","","","","","","","","","","","","","","","","","","","","","","","","","",""]
[null,null,null,null,null,{"$f":"($D$8*N5)/H5","v":39},{"$f":"IFERROR(D10/D10+1,\"\")","v":2},{"$f":"IF($D$12=\"\",\"\",$D$12)","v":5},{"$f":"IF($D$8=\"\",\"\",$D$8)","v":15},{"$f":"IFERROR($D$10/$D$10+1,\"\")","v":2},{"$f":"IFERROR($D$10*$D$12/J5,\"\")","v":12.5},{"$f":"(I5+J5-1)*K5","v":200},{"$f":"I5*N5","v":195},{"$f":"IFERROR(ROUNDUP($D$10*$D$12/J5,0),\"\")","v":13},{"$f":"_xlfn.IFS(T5<=0.3,\"Bad\",AND(T5<0.5,T5>0.3),\"Macro\",T5>=0.5,\"Norm\")","v":"Bad"},{"$f":"IFERROR(SUM(I5+J5-1)*N5,\"\")","v":208},{"$f":"$D$15/J5","v":12},{"$f":"IFERROR(SUM(J5*N5-$D$10*$D$12),\"\")","v":1},{"$f":"IFERROR(IF($D$26=\"\",\"\",$D$26/J5),\"\")","v":24712.5},{"$f":"IFERROR($D$31/P5,\"\")","v":0.1875},{"$f":"IFERROR(I5/J5,\"\")","v":7.5},{"$f":"IFERROR(I5/(J5-1),\"\")","v":15},{"$f":"IF(ROW(W5)=$W$3+4,\"x\",\"\")","v":""},null,2,{"$f":"IF($Y5<=$D$10,IF(COLUMN()<26+$D$12,\"\",OFFSET(Z4,0,-$D$12,1,1)),\"\")","v":""},{"$f":"IF($Y5<=$D$10,IF(COLUMN()<26+$D$12,\"\",OFFSET(AA4,0,-$D$12,1,1)),\"\")","v":""},"","","",1,1,1,1,1,2,2,2,2,2,3,3,3,3,3,4,4,4,4,4,5,5,5,5,5,6,6,6,6,6,7,7,7,7,7,8,8,8,8,8,9,9,9,9,9,10,10,10,10,10,11,11,11,11,11,12,12,12,12,12,{"$f":"IF($Y5<=$D$10,IF(COLUMN()<26+$D$12,\"\",OFFSET(CM4,0,-$D$12,1,1)),\"\")","v":13},13,13,13,13,14,14,14,14,14,15,15,15,15,15,"","","","","","","","","","","","","","","","","","","","","","","","","","","","","","","","","","","","","","","","","","","","","","","","","",{"$f":"IF($Y5<=$D$10,IF(COLUMN()<26+$D$12,\"\",OFFSET(EY4,0,-$D$12,1,1)),\"\")","v":""},"","","","","","","","","","","","","","","","","","","","","","","","","","","","","","","","","","","","","","","","","","","","","","","","","","","","","","","","","","","","","","","",{"$f":"IF($Y5<=$D$10,IF(COLUMN()<26+$D$12,\"\",OFFSET(HK4,0,-$D$12,1,1)),\"\")","v":""},"","","","","","","","","","","","","","","","","","",{"$f":"IF($Y5<=$D$10,IF(COLUMN()<26+$D$12,\"\",OFFSET(ID4,0,-$D$12,1,1)),\"\")","v":""},{"$f":"IF($Y5<=$D$10,IF(COLUMN()<26+$D$12,\"\",OFFSET(IE4,0,-$D$12,1,1)),\"\")","v":""},"","","","","","","","","","","","","","","","","","","","","","","","","","","","","","","","","","","",""]
[null,"Takt Inputs",null,null,null,{"$f":"($D$8*N6)/H6","v":27},{"$f":"IFERROR(G5+1,\"\")","v":3},{"$f":"IF($D$12=\"\",\"\",$D$12)","v":5},{"$f":"IF($D$8=\"\",\"\",$D$8)","v":15},{"$f":"IFERROR(J5+1,\"\")","v":3},8.3333333333333339,141.66666666666669,135,{"$f":"IFERROR(ROUNDUP($D$10*$D$12/J6,0),\"\")","v":9},{"$f":"_xlfn.IFS(T6<=0.3,\"Bad\",AND(T6<0.5,T6>0.3),\"Macro\",T6>=0.5,\"Norm\")","v":"Bad"},153,8,2,16475,0.25490196078431371,5,7.5,{"$f":"IF(ROW(W6)=$W$3+4,\"x\",\"\")","v":""},null,3,{"$f":"IF($Y6<=$D$10,IF(COLUMN()<26+$D$12,\"\",OFFSET(Z5,0,-$D$12,1,1)),\"\")","v":""},"","","","","","","","","",1,1,1,1,1,2,2,2,2,2,3,3,3,3,3,4,4,4,4,4,5,5,5,5,5,6,6,6,6,6,7,7,7,7,7,8,8,8,8,8,9,9,9,9,9,10,10,10,10,10,11,11,11,11,11,12,12,12,12,12,13,13,13,13,13,14,14,14,14,14,15,15,15,15,15,"","","","","","","","","","","","","","","","","","","","","","","","","","","","","","","","","","","","","","","","","","","","","","","","","","","","","","","","","","","","","","","","","","","","","","","","","","","","","","","","","","","","","","","","","","","","","","","","","","","","","","","","","","","","","","","","","","","","","","","","","","","","","","","",{"$f":"IF($Y6<=$D$10,IF(COLUMN()<26+$D$12,\"\",OFFSET(ID5,0,-$D$12,1,1)),\"\")","v":""},"","","","","","","","","","","","","","","","","","","","","","","","","","","","","","","","","","","","",""]
[null,null,null,null,null,21,{"$f":"IFERROR(G6+1,\"\")","v":4},{"$f":"IF($D$12=\"\",\"\",$D$12)","v":5},{"$f":"IF($D$8=\"\",\"\",$D$8)","v":15},{"$f":"IFERROR(J6+1,\"\")","v":4},6.25,112.5,105,{"$f":"IFERROR(ROUNDUP($D$10*$D$12/J7,0),\"\")","v":7},{"$f":"_xlfn.IFS(T7<=0.3,\"Bad\",AND(T7<0.5,T7>0.3),\"Macro\",T7>=0.5,\"Norm\")","v":"Macro"},126,6,3,12356.25,0.30952380952380953,3.75,5,"",null,4,{"$f":"IF($Y7<=$D$10,IF(COLUMN()<26+$D$12,\"\",OFFSET(Z6,0,-$D$12,1,1)),\"\")","v":""},"","","","","","","","","","","","","","",1,1,1,1,1,2,2,2,2,2,3,3,3,3,3,4,4,4,4,4,5,5,5,5,5,6,6,6,6,6,7,7,7,7,7,8,8,8,8,8,9,9,9,9,9,10,10,10,10,10,11,11,11,11,11,12,12,12,12,12,13,13,13,13,13,14,14,14,14,14,15,15,15,15,15,"","","","","","","","","","","","","","","","","","","","","","","","","","","","","","","","","","","","","","","","","","","","","","","","","","","","","","","","","","","","","","","","","","","","","","","","","","","","","","","","","","","","","","","","","","","","","","","","","","","","","","","","","","","","","","","","","","","","","","","","","","","","","","","","","","","","","","","","","","","","","","","","","","","","","","","","","","","","","","","",""]
[null,"Takt Wagons",null,15,null,{"$f":"($D$8*N8)/H8","v":15},{"$f":"IFERROR(G7+1,\"\")","v":5},5,15,5,5,95,75,{"$f":"IFERROR(ROUNDUP($D$10*$D$12/J8,0),\"\")","v":5},{"$f":"_xlfn.IFS(T8<=0.3,\"Bad\",AND(T8<0.5,T8>0.3),\"Macro\",T8>=0.5,\"Norm\")","v":"Macro"},95,4.8,0,9885,0.41052631578947368,3,3.75,"",null,5,{"$f":"IF($Y8<=$D$10,IF(COLUMN()<26+$D$12,\"\",OFFSET(Z7,0,-$D$12,1,1)),\"\")","v":""},"","",{"$f":"IF($Y8<=$D$10,IF(COLUMN()<26+$D$12,\"\",OFFSET(AC7,0,-$D$12,1,1)),\"\")","v":""},"","","","","","","","","","","","","","","","",1,1,1,1,1,2,2,2,2,2,3,3,3,3,3,4,4,4,4,4,5,5,5,5,5,6,6,6,6,6,7,7,7,7,7,8,8,8,8,8,9,9,9,9,9,10,10,10,10,10,11,11,11,11,11,12,12,12,12,12,13,13,13,13,13,14,14,14,14,14,15,15,15,15,15,"","","","","","","","","","","","","","","","","","","","","","","","","","","","","","","","","",{"$f":"IF($Y8<=$D$10,IF(COLUMN()<26+$D$12,\"\",OFFSET(EX7,0,-$D$12,1,1)),\"\")","v":""},"","","","","","","","","","","","","","","","","","","","","","","","","","","","","","","","","","","","","","","","","","","","","","","","","","","","","","","","","","","","","","","",{"$f":"IF($Y8<=$D$10,IF(COLUMN()<26+$D$12,\"\",OFFSET(HJ7,0,-$D$12,1,1)),\"\")","v":""},"","","","","","","","","","","","","","","","","","","","","","","","","","","","","","","","","","","","","","","","","","","","","","","","","","","","","","","","",""]
[null,null,null,null,null,{"$f":"($D$8*N9)/H9","v":15},{"$f":"IFERROR(G8+1,\"\")","v":6},5,15,{"$f":"IFERROR(J8+1,\"\")","v":6},4.166666666666667,83.333333333333343,75,{"$f":"IFERROR(ROUNDUP($D$10*$D$12/J9,0),\"\")","v":5},{"$f":"_xlfn.IFS(T9<=0.3,\"Bad\",AND(T9<0.5,T9>0.3),\"Macro\",T9>=0.5,\"Norm\")","v":"Macro"},100,4,5,8237.5,0.39,2.5,3,"",null,6,{"$f":"IF($Y9<=$D$10,IF(COLUMN()<26+$D$12,\"\",OFFSET(Z8,0,-$D$12,1,1)),\"\")","v":""},{"$f":"IF($Y9<=$D$10,IF(COLUMN()<26+$D$12,\"\",OFFSET(AA8,0,-$D$12,1,1)),\"\")","v":""},"","","","","","","","","","","","","","","","","","","","","","","","","","","","","","","","","","","","","","","","","","","","","","","","","","","","","","","","","","","","","","","",{"$f":"IF($Y9<=$D$10,IF(COLUMN()<26+$D$12,\"\",OFFSET(CM8,0,-$D$12,1,1)),\"\")","v":""},"","","","","","","","","","","","","","","","","","","","","","","","","","","","","","","","","","","","","","","","","","","","","","","","","","","","","","","","","","","","","","","","","","","","","","","","","","","","","","",{"$f":"IF($Y9<=$D$10,IF(COLUMN()<26+$D$12,\"\",OFFSET(FN8,0,-$D$12,1,1)),\"\")","v":""},"","","","","","","","","","","","","","","","","","","","","","","","","","","","","","","","","","","","","","","","","","","","","","","","","","","","","","","","","","","","","","","","","","","","","","","","","","","","","","","","","","","","","","","","","","","","","","","","","","","","","","","","",""]
[null,"Takt Zones",null,5,null,{"$f":"($D$8*N10)/H10","v":12},7,5,15,{"$f":"IFERROR(J9+1,\"\")","v":7},3.5714285714285716,75,60,{"$f":"IFERROR(ROUNDUP($D$10*$D$12/J10,0),\"\")","v":4},{"$f":"_xlfn.IFS(T10<=0.3,\"Bad\",AND(T10<0.5,T10>0.3),\"Macro\",T10>=0.5,\"Norm\")","v":"Macro"},84,3.4285714285714284,3,7060.7142857142853,0.4642857142857143,2.1428571428571428,2.5,"",null,7,{"$f":"IF($Y10<=$D$10,IF(COLUMN()<26+$D$12,\"\",OFFSET(Z9,0,-$D$12,1,1)),\"\")","v":""},"","","","","","","","","","","","","","","","","","","","","","","","","","","","","","","","","","","","","","","","","","","","","","","","","","","","","","","","","","","","","","","","","","","","","","","","","","","","","","","","","","","","","","","","","","","","","","","","","","","","","","","","","","","","","","","","","","","","","","","","","","","","","","","","","","","","","","","","","","","","","","","","","","","","","","","","","","","","","","","","","","","","","","","","","","","","","","","","","","","","","","","","","","","","","","","","","","","","","","","","","","","","","","","","","","","","","","","","","","","","","","","","","","","","","","","","","","","","","","","","","","","","","","","","",""]
[null,null,null,null,null,12,8,5,15,8,3.125,68.75,60,4,{"$f":"_xlfn.IFS(T11<=0.3,\"Bad\",AND(T11<0.5,T11>0.3),\"Macro\",T11>=0.5,\"Norm\")","v":"Macro"},88,3,7,6178.125,0.44318181818181818,1.875,2.1428571428571428,"",null,8,"","","","","","","","","","","","","","","","","","","","","","","","","","","","","","","","","","","","","","","","","","","","","","","","","","","","","","","","","","","","","","","","","","","","","","","","","","","","","","","","","","","","","","","","","","","","","","","","","","","","","","","","","","","","","","","","","","","","","","","","","","","","","","","","","","","","","","","","","","","","","","","","","","","","","","","","","","","","","","","","","","","","","","","","","","","","","","","","","","","","","","","","","","","","","","","","","","","","","","","","","","","","","","","","","","","","","","","","","","","","","","","","","","","","","","","","","","","","","","","","","","","","","","",{"$f":"IF($Y11<=$D$10,IF(COLUMN()<26+$D$12,\"\",OFFSET(JL10,0,-$D$12,1,1)),\"\")","v":""},"","",""]
[null,"Takt Time",null,5,null,9,9,5,15,9,2.7777777777777777,63.888888888888886,45,3,{"$f":"_xlfn.IFS(T12<=0.3,\"Bad\",AND(T12<0.5,T12>0.3),\"Macro\",T12>=0.5,\"Norm\")","v":"Norm"},69,2.6666666666666665,2,5491.666666666667,0.56521739130434778,1.6666666666666667,1.875,"",null,9,"","","","","","","","","","","","","","","","","","","","","","","","","","","","","","","","","","","","","","","","","","","","","","","","","","","","","","","","","","","","","","","","",{"$f":"IF($Y12<=$D$10,IF(COLUMN()<26+$D$12,\"\",OFFSET(CL11,0,-$D$12,1,1)),\"\")","v":""},"","","","","","","","","","","","","","","","","","","","","","","","","","","","","","","","","","","","","","","","","","","","","","","","","","","","","","","","","","","","","","","","","","","","","","","","","","","","","","","","","","","","","","","","","","","","","","","","","","","","","","","","","","","","","","","","","","","","","","","","","","","","","","","","","","","","","","","","","","","","","","","","","","","","","","","","","","","","","","","","","","","",{"$f":"IF($Y12<=$D$10,IF(COLUMN()<26+$D$12,\"\",OFFSET(IT11,0,-$D$12,1,1)),\"\")","v":""},"","","","","","","","","","","","","","","","","","","","",""]
[null,null,null,null,null,9,10,5,15,10,2.5,60,45,3,{"$f":"_xlfn.IFS(T13<=0.3,\"Bad\",AND(T13<0.5,T13>0.3),\"Macro\",T13>=0.5,\"Norm\")","v":"Norm"},72,2.4,5,4942.5,0.54166666666666663,1.5,1.6666666666666667,"",null,10,{"$f":"IF($Y12<=$D$10,IF(COLUMN()<26+$D$12,\"\",OFFSET(Z12,0,-$D$12,1,1)),\"\")","v":""},"","","","","","","","","","","","","","","","","","","","","","","","","","","","","","","","","","","","","","","","","","","","","","","","","","","","","","","","","","","","","","","",{"$f":"IF($Y12<=$D$10,IF(COLUMN()<26+$D$12,\"\",OFFSET(CL12,0,-$D$12,1,1)),\"\")","v":""},"","","","","","","","","","","","","","","","","","","","","","","","","","","","","","","","","","","","","","","","","","","","","","","","","","","","","","","","","","","","","","","",{"$f":"IF($Y12<=$D$10,IF(COLUMN()<26+$D$12,\"\",OFFSET(EX12,0,-$D$12,1,1)),\"\")","v":""},"","","","","","","","","","","","","","","","","","","","","","","","","","","","","","","","","","","","","","","","","","","","","","","","","","","","","","","","","","","","","","","",{"$f":"IF($Y12<=$D$10,IF(COLUMN()<26+$D$12,\"\",OFFSET(HJ12,0,-$D$12,1,1)),\"\")","v":""},"","","","","","","","","","","","","","",null,"","",null,{"$f":"IF($Y12<=$D$10,IF(COLUMN()<26+$D$12,\"\",OFFSET(IC12,0,-$D$12,1,1)),\"\")","v":""},"",null,{"$f":"IF($Y12<=$D$10,IF(COLUMN()<26+$D$12,\"\",OFFSET(IF12,0,-$D$12,1,1)),\"\")","v":""},"",null,{"$f":"IF($Y12<=$D$10,IF(COLUMN()<26+$D$12,\"\",OFFSET(II12,0,-$D$12,1,1)),\"\")","v":""},"",null,{"$f":"IF($Y12<=$D$10,IF(COLUMN()<26+$D$12,\"\",OFFSET(IL12,0,-$D$12,1,1)),\"\")","v":""},"",null,{"$f":"IF($Y12<=$D$10,IF(COLUMN()<26+$D$12,\"\",OFFSET(IO12,0,-$D$12,1,1)),\"\")","v":""},"",null,{"$f":"IF($Y12<=$D$10,IF(COLUMN()<26+$D$12,\"\",OFFSET(IR12,0,-$D$12,1,1)),\"\")","v":""},"",null,{"$f":"IF($Y12<=$D$10,IF(COLUMN()<26+$D$12,\"\",OFFSET(IU12,0,-$D$12,1,1)),\"\")","v":""},"",null,{"$f":"IF($Y12<=$D$10,IF(COLUMN()<26+$D$12,\"\",OFFSET(IX12,0,-$D$12,1,1)),\"\")","v":""},"",null,{"$f":"IF($Y12<=$D$10,IF(COLUMN()<26+$D$12,\"\",OFFSET(JA12,0,-$D$12,1,1)),\"\")","v":""},"",null,{"$f":"IF($Y12<=$D$10,IF(COLUMN()<26+$D$12,\"\",OFFSET(JD12,0,-$D$12,1,1)),\"\")","v":""},"",null,{"$f":"IF($Y12<=$D$10,IF(COLUMN()<26+$D$12,\"\",OFFSET(JG12,0,-$D$12,1,1)),\"\")","v":""},"",null,{"$f":"IF($Y12<=$D$10,IF(COLUMN()<26+$D$12,\"\",OFFSET(JJ12,0,-$D$12,1,1)),\"\")","v":""},"",null,{"$f":"IF($Y12<=$D$10,IF(COLUMN()<26+$D$12,\"\",OFFSET(JM12,0,-$D$12,1,1)),\"\")","v":""},""]
[null,"Duration",null,{"$f":"IF(OR(D8=\"\",D10=\"\",D12=\"\"),\"\",(D8+D10-1)*D12)","v":95},null,9,11,5,15,11,2.2727272727272729,56.81818181818182,45,3,{"$f":"_xlfn.IFS(T14<=0.3,\"Bad\",AND(T14<0.5,T14>0.3),\"Macro\",T14>=0.5,\"Norm\")","v":"Norm"},75,2.1818181818181817,8,4493.181818181818,0.52,1.3636363636363635,1.5,"",null,11,"","","","","","","","","","","","","","","","","","","","","","","","","","","","","","","","","","","","","","","","","","","","","","","","","","","","","","","","","","","","","","","","","","","","","","","","","","","","","","","","","","","","","","","","","","","","","","","","","","","","","","","","","","","","","","","","","","","","","","","","","","","","","","","","","","","","","","","","","","","","","","","","","","","","","","","","","","","","","","","","","","","","","","","","","","","","","","","","","","","","","","","","","","","","","","","","","","","","","","","","","","","","","","","",null,"","",null,"","",null,"","",null,"","",null,"","",null,"","",null,"","",null,"","",null,"","",null,"","",null,"","",null,"","",null,"","",null,"",""]
[null,"Number of SSU's",null,24,null,9,12,5,15,12,2.0833333333333335,54.166666666666671,45,3,{"$f":"_xlfn.IFS(T15<=0.3,\"Bad\",AND(T15<0.5,T15>0.3),\"Macro\",T15>=0.5,\"Norm\")","v":"Norm"},78,2,11,4118.75,0.5,1.25,1.3636363636363635,"",null,12,"","","","","","","","","","","","","","","","","","","","","","","","","","","","","","","","","","","","","","","","","","","","","","","","","","","","","","","","","","","","","","","","","","","","","","","","","","","","","","","","","","","","","","","","","","","","","","","","","","","","","","","","","","","","","","","","","","","","","","","","","","","","","","","","","","","","","","","","","","","","","","","","","","","","","","","","","","","","","","","","","","","","","","","","","","","","","","","","","","","","","","","","","","","","","","","","","","","","","","","","","","","","","","","",null,"","",null,"","",null,"","",null,"","",null,"","",null,"","",null,"","",null,"","",null,"","",null,"","",null,"","",null,"","",null,"","",null,"",""]
[null,null,null,null,null,6,13,5,15,13,1.9230769230769231,51.923076923076927,30,2,{"$f":"_xlfn.IFS(T16<=0.3,\"Bad\",AND(T16<0.5,T16>0.3),\"Macro\",T16>=0.5,\"Norm\")","v":"Norm"},54,1.8461538461538463,1,3801.9230769230771,0.72222222222222221,1.1538461538461537,1.25,"",null,13,"","","","","","","","","","","","","","","","","","","","","","","","","","","","","","","","","","","","","","","","","","","","","","","","","","","","","","","","","","","","","","","",{"$f":"IF($Y15<=$D$10,IF(COLUMN()<26+$D$12,\"\",OFFSET(CK15,0,-$D$12,1,1)),\"\")","v":""},"","","","","","","","","","","","","","","","","","","","","","","","","","","","","","","","","","","","","","","","","","","","","","","","","","","","","","","","","","","","","","","",{"$f":"IF($Y15<=$D$10,IF(COLUMN()<26+$D$12,\"\",OFFSET(EW15,0,-$D$12,1,1)),\"\")","v":""},"","","","","","","","","","","","","","","","","","","","","","","","","","","","","","","","","","","","","","","","","","","","","","","","","","","","","","","","","","","","","","","",{"$f":"IF($Y15<=$D$10,IF(COLUMN()<26+$D$12,\"\",OFFSET(HI15,0,-$D$12,1,1)),\"\")","v":""},"","","","","","","","","","","","","","","",null,"","",null,"","",null,"","",null,"","",null,"","",null,"","",null,"","",null,"","",null,"","",null,"","",null,"","",null,"","",null,"","",null,"",""]
[null,null,null,null,null,6,14,5,15,14,1.7857142857142858,50,30,{"$f":"IFERROR(ROUNDUP($D$10*$D$12/J17,0),\"\")","v":2},{"$f":"_xlfn.IFS(T17<=0.3,\"Bad\",AND(T17<0.5,T17>0.3),\"Macro\",T17>=0.5,\"Norm\")","v":"Norm"},56,1.7142857142857142,3,3530.3571428571427,0.6964285714285714,1.0714285714285714,1.1538461538461537,"",null,14,{"$f":"IF($Y16<=$D$10,IF(COLUMN()<26+$D$12,\"\",OFFSET(Z16,0,-$D$12,1,1)),\"\")","v":""},"","","","","","","","","","","","","","","","","","","","","","","","","","","","","","","","","","","","","","","","","","","","","","","","","","","","","","","","","","","","","","","","","","","","","","","","","","","","","","",{"$f":"IF($Y16<=$D$10,IF(COLUMN()<26+$D$12,\"\",OFFSET(DA16,0,-$D$12,1,1)),\"\")","v":""},"","","","","","","","","","","","","","","","","","","","","","","","","","","","","","","","","","","","","","","","","","","","","","","","","","","","","","","","","","","","","","","",{"$f":"IF($Y16<=$D$10,IF(COLUMN()<26+$D$12,\"\",OFFSET(FM16,0,-$D$12,1,1)),\"\")","v":""},"","","","","","","","","","","","","","","","","","","","","","","","","","","","","","","","","","","","","","","","","","","","","","","","","","","","","","","","","","","","","","","",null,"","",null,"","",null,"","",null,"","",null,"","",null,"","",null,"","",null,"","",null,"","",null,"","",null,"","",null,"","",null,"","",null,"",""]
[null,"Area Inputs (m2, sqft)",null,null,null,6,15,5,15,15,1.6666666666666667,48.333333333333336,30,{"$f":"IFERROR(ROUNDUP($D$10*$D$12/J18,0),\"\")","v":2},{"$f":"_xlfn.IFS(T18<=0.3,\"Bad\",AND(T18<0.5,T18>0.3),\"Macro\",T18>=0.5,\"Norm\")","v":"Norm"},58,1.6,5,3295,0.67241379310344829,1,1.0714285714285714,"",null,15,"","","","","","","","","","","","","","","","","","","","","","","","","","","","","","","","","","","","","","","","","","","","","","","","","","","","","","","","","","","","","","","","","","","","","","","","","","","","","","","","","","","","","","","","","","","","","","","","","","","","","","","","","","","","","","","","","","","","","","","","","","","","","","","","","","","","","","","","","","","","","","","","","","","","","","","","","","","","","","","","","","","","","","","","","","","","","","","","","","","","","","","","","","","","","","","","","","","","","","","","","","","","","","","",null,"","",null,"","",null,"","",null,"","",null,"","",null,"","",null,"","",null,"","",null,"","",null,"","",null,"","",null,"","",null,"","",null,"",""]
[null,null,null,null,null,6,16,5,15,16,1.5625,46.875,30,2,{"$f":"_xlfn.IFS(T19<=0.3,\"Bad\",AND(T19<0.5,T19>0.3),\"Macro\",T19>=0.5,\"Norm\")","v":"Norm"},60,1.5,7,3089.0625,0.65,0.9375,1,"",null,16,"","","","","","","","","","","","","","","","","","","","","","","","","","","","","","","","","","","","","","","","","","","","","","","","","","","","","","","","","","","","","","","","","","","","","","","","","","","","","","","","","","","","","","","","","","","","","","","","","","","","","","","","","","","","","","","","","","","","","","","","","","","","","","","","","","","","","","","","","","","","","","","","","","","","","","","","","","","","","","","","","","","","","","","","","","","","","","","","","","","","","","","","","","","","","","","","","","","","","","","","","","","","","","","",null,"","",null,"","",null,"","",null,"","",null,"","",null,"","",null,"","",null,"","",null,"","",null,"","",null,"","",null,"","",null,"","",null,"",""]
[null,"Area / Zone",null,9885,null,6,17,5,15,17,1.4705882352941178,45.588235294117652,30,2,{"$f":"_xlfn.IFS(T20<=0.3,\"Bad\",AND(T20<0.5,T20>0.3),\"Macro\",T20>=0.5,\"Norm\")","v":"Norm"},62,1.411764705882353,9,2907.3529411764707,0.62903225806451613,0.88235294117647056,0.9375,"",null,17,"","","","","","","","","","","","","","","","","","","","","","","","","","","","","","","","","","","","","","","","","","","","","","","","","","","","","","","","","","","","","","","","","","","","","","","","","","","","","","","","","","","","","","","","","","","","","","","","","","","","","","","","","","","","","","","","","","","","","","","","","","","","","","","","","","","","","","","","","","","","","","","","","","","","","","","","","","","","","","","","","","","","","","","","","","","","","","","","","","","","","","","","","","","","","","","","","","","","","","","","","","","","","","","",null,"","",null,"","",null,"","",null,"","",null,"","",null,"","",null,"","",null,"","",null,"","",null,"","",null,"","",null,"","",null,"","",null,"",""]
[null,null,null,null,null,6,18,5,15,18,1.3888888888888888,44.444444444444443,30,2,{"$f":"_xlfn.IFS(T21<=0.3,\"Bad\",AND(T21<0.5,T21>0.3),\"Macro\",T21>=0.5,\"Norm\")","v":"Norm"},64,1.3333333333333333,11,2745.8333333333335,0.609375,0.83333333333333337,0.88235294117647056,"",null,18,"","","",{"$f":"IF($Y20<=$D$10,IF(COLUMN()<26+$D$12,\"\",OFFSET(AC20,0,-$D$12,1,1)),\"\")","v":""},"","","","","","","","","","","","","","","","","","","","","","","","","","","","","","","","","","","","","","","","","","","","","","","","","","","","","","","","","","","","","","","","","","","","","","","","","","","","","","","","","","","","","","","","","","","","","","","","","","","","","","","","","","","","","","","","","","","","","","","","","","","","","","","","","","","","","","","","","","","","","","","","","","","","","","","","","","","","","","","","","","","","","","","","","","","","","","","","","","","","","","","","","","","","","","","","","","","","","","","","","","","",null,"","",null,"","",null,"","",null,"","",null,"","",null,"","",null,"","",null,"","",null,"","",null,"","",null,"","",null,"","",null,"","",null,"",""]
[null,"Min Zone Size",null,1000,null,6,19,5,15,19,1.3157894736842106,43.421052631578952,30,2,{"$f":"_xlfn.IFS(T22<=0.3,\"Bad\",AND(T22<0.5,T22>0.3),\"Macro\",T22>=0.5,\"Norm\")","v":"Norm"},66,1.263157894736842,13,2601.3157894736842,0.59090909090909094,0.78947368421052633,0.83333333333333337,"",null,19,{"$f":"IF($Y21<=$D$10,IF(COLUMN()<26+$D$12,\"\",OFFSET(Z21,0,-$D$12,1,1)),\"\")","v":""},"","","","","","","","","","","","","","","","","","","","","","","","","","","","","","","","","","","","","","","","","","","","","","","","","","","","","","","","","","","","","","","","","","","","","","","","","","","","","","","","","","","","","","","","","","","","","",{"$f":"IF($Y21<=$D$10,IF(COLUMN()<26+$D$12,\"\",OFFSET(DP21,0,-$D$12,1,1)),\"\")","v":""},"","","","","","","","","","","","","","","","","","","","","","","","","","","","","","","","","","","","","","","","","","","","","","","","","","","","","","","","","","","","","","","",{"$f":"IF($Y21<=$D$10,IF(COLUMN()<26+$D$12,\"\",OFFSET(GB21,0,-$D$12,1,1)),\"\")","v":""},"","","","","","","","","","","","","","","","","","","","","","","","","","","","","","","","","","","","","","","","","","","","","","","","",null,"","",null,"","",null,"","",null,"","",null,"","",null,"","",null,"","",null,"","",null,"","",null,"","",null,"","",null,"","",null,"","",null,"",""]
[null,null,null,null,null,6,20,5,15,20,1.25,42.5,30,2,{"$f":"_xlfn.IFS(T23<=0.3,\"Bad\",AND(T23<0.5,T23>0.3),\"Macro\",T23>=0.5,\"Norm\")","v":"Norm"},68,1.2,15,2471.25,0.57352941176470584,0.75,0.78947368421052633,"",null,20,"","","","","","","","","","","","","","","","","","","","","","","","","","","","","","","","","","","","","","","","","","","","","","","","","","","","","","","","","","","","","","","","","","","","","","","","","","","","","","","",{"$f":"IF($Y22<=$D$10,IF(COLUMN()<26+$D$12,\"\",OFFSET(DA22,0,-$D$12,1,1)),\"\")","v":""},"","","","","","","","","","","","","","","","","","","","","","","","","","","","","","","","","","","","","","","","","","","","","","","","","","","","","","","","","","","","","","","",{"$f":"IF($Y22<=$D$10,IF(COLUMN()<26+$D$12,\"\",OFFSET(FM22,0,-$D$12,1,1)),\"\")","v":""},"","","","","","","","","","","","","","","","","","","","","","","","","","","","","","","","","","","","","","","","","","","","","","","","","","","","","","","","","","","","","","","",null,"","",null,"","",null,"","",null,"","",null,"","",null,"","",null,"","",null,"","",null,"","",null,"","",null,"","",null,"","",null,"","",null,"",""]
[null,"Max Zone Size",null,10000,null,6,21,5,15,21,1.1904761904761905,41.666666666666664,30,2,{"$f":"_xlfn.IFS(T24<=0.3,\"Bad\",AND(T24<0.5,T24>0.3),\"Macro\",T24>=0.5,\"Norm\")","v":"Norm"},70,1.1428571428571428,17,2353.5714285714284,0.55714285714285716,0.7142857142857143,0.75,"",null,21,"","","","","","","","","","","","","","","","","","","","","","","","","","","","","","","","","","","","","","","","","","","","","","","","","","","","","","","","","","","","","","","","","","","","","","","","","","","","","","","","","","","","","","","","","","","","","","","","","","","","","","","","","","","","","","","","","","","","","","","","","","","","","","","","","","","","","","","","","","","","","","","","","","","","","","","","","","","","","","","","","","","","","","","","","","","","","","","","","","","","","","","","","","","","","","","","","","","","","","","","","","","","","","","",null,"","",null,"","",null,"","",null,"","",null,"","",null,"","",null,"","",null,"","",null,"","",null,"","",null,"","",null,"","",null,"","",null,"",""]
[null,null,null,null,null,6,22,5,15,22,1.1363636363636365,40.909090909090914,30,2,{"$f":"_xlfn.IFS(T25<=0.3,\"Bad\",AND(T25<0.5,T25>0.3),\"Macro\",T25>=0.5,\"Norm\")","v":"Norm"},72,1.0909090909090908,19,2246.590909090909,0.54166666666666663,0.68181818181818177,0.7142857142857143,"",null,22,"","","","","","","","","","","","","","","","","","",{"$f":"IF($Y24<=$D$10,IF(COLUMN()<26+$D$12,\"\",OFFSET(AR24,0,-$D$12,1,1)),\"\")","v":""},"","","","","","","","","","","","","","","","","","","","","","","","","","","","","","","","","","","","","","","","","","","","","","","","","","","","","","","","","","","","","","","","","","","","","","","","","","","","","","","","","","","","","","","","","","","","","","","","","","","","","","","","","","","","","","","","","","","","","","","","","","","","","","","","","","","","","","","","","","","","","","","","","","","","","","","","","","","","","","","","","","","","","","","","","","","","","","","","","","","","","","","","","","","","",null,"","",null,"","",null,"","",null,"","",null,"","",null,"","",null,"","",null,"","",null,"","",null,"","",null,"","",null,"","",null,"","",null,"",""]
[null,"Total SQFT of Phase",null,{"$f":"IF(OR(D10=\"\",D20=\"\"),\"\",D10*D20)","v":49425},null,6,23,5,15,23,1.0869565217391304,40.217391304347821,30,2,{"$f":"_xlfn.IFS(T26<=0.3,\"Bad\",AND(T26<0.5,T26>0.3),\"Macro\",T26>=0.5,\"Norm\")","v":"Norm"},74,1.0434782608695652,21,2148.913043478261,0.52702702702702697,0.65217391304347827,0.68181818181818177,"",null,23,"","","","","","","","","","","","","","","","",{"$f":"IF($Y25<=$D$10,IF(COLUMN()<26+$D$12,\"\",OFFSET(AP25,0,-$D$12,1,1)),\"\")","v":""},"","","","","","","","","","","","","","","","","","","","","","","","","","","","","","","","","","","","","","","","","","","","","","","","","","","","","","","","","","","","","","","","","","","","","","","","","","","","","","","","","","","","","","","","","","","","","","","","","","","","","","","","","","","","","","","","","","","","","","","","","","","","","","","","","","","","","","","","","","","","","","","","","","","","","","","","","","","","","","","","","","","","","","","","","","","","","","","","","","","","","","","","","","","","","","",null,"","",null,"","",null,"","",null,"","",null,"","",null,"","",null,"","",null,"","",null,"","",null,"","",null,"","",null,"","",null,"","",null,"",""]
[null,null,null,null,null,6,24,5,15,24,1.0416666666666667,39.583333333333336,30,2,{"$f":"_xlfn.IFS(T27<=0.3,\"Bad\",AND(T27<0.5,T27>0.3),\"Macro\",T27>=0.5,\"Norm\")","v":"Norm"},76,1,23,2059.375,0.51315789473684215,0.625,0.65217391304347827,"",null,24,"","","","","","","","","","","","","","","","","","","","","","","","","","","","","","","","","","","","","","","","","","","","","","","","","","","","","","","","","","","","","","","","","","","","","","","","","","","","","","","","","","","","","","","","","","","","","","","","","","","","","","","","","","","","","","","","","","","","","","","","","","","","","","","","","","","","","","","","","","","","","","","","","","","","","","","","","","","","","","","","","","","","","","","","","","","","","","","","","","","","","","","","","","","","","","","","","","","","","","","","","","","","","","","",null,"","",null,"","",null,"","",null,"","",null,"","",null,"","",null,"","",null,"","",null,"","",null,"","",null,"","",null,"","",null,"","",null,"",""]
[null,"Shortest Durations",null,null,null,3,25,5,15,25,1,39,15,1,{"$f":"_xlfn.IFS(T28<=0.3,\"Bad\",AND(T28<0.5,T28>0.3),\"Macro\",T28>=0.5,\"Norm\")","v":"Norm"},39,0.96,0,1977,1,0.6,0.625,"",null,25,"","","","","","","","","","","","","","","","","","","","","","","","","","","","","","","","","","","","","","","","","","","","","","","","","","","","","","","","","","","","","","","","","","","","","","","","","","","","","","","","","","","","","","","","","","","","","","","","","","","","","","","","","","","","","","","","","","","","","","","","","","","","","","","","","","","","","","","","","","","","","","","","","","","","","","","","","","","","","","","","","","","","","","","","","","","","","","","","","","","","","","","","","","","","","","","","","","","","","","","","","","","","","","","",null,{"$f":"IF($Y27<=$D$10,IF(COLUMN()<26+$D$12,\"\",OFFSET(HZ27,0,-$D$12,1,1)),\"\")","v":""},"",null,"","",null,"","",null,"","",null,"","",null,"","",null,"","",null,"","",null,"","",null,"","",null,"","",null,"","",null,"","",null,"",""]
[null,null,null,null,null,3,26,5,15,26,0.96153846153846156,38.46153846153846,15,1,{"$f":"_xlfn.IFS(T29<=0.3,\"Bad\",AND(T29<0.5,T29>0.3),\"Macro\",T29>=0.5,\"Norm\")","v":"Norm"},40,0.92307692307692313,1,1900.9615384615386,0.97499999999999998,0.57692307692307687,0.6,"",null,26,"","","","","","","","","","","","","","","","","","","","","","","","","","","","","","","","","","","","","","","","","","","","","","","","","","","","","","","","","","","","","","","","","","","","","","","","","","","","","","","","","","","","","","","","","","","","","","","","","","","","","","","","","","","","","","","","","","","","","","",{"$f":"IF($Y28<=$D$10,IF(COLUMN()<26+$D$12,\"\",OFFSET(EN28,0,-$D$12,1,1)),\"\")","v":""},"","","","","","","","","","","","","","","","","","","","","","","","","","","","","","","","","","","","","","","","","","","","","","","","","","","","","","","","","","","","","","","",{"$f":"IF($Y28<=$D$10,IF(COLUMN()<26+$D$12,\"\",OFFSET(GZ28,0,-$D$12,1,1)),\"\")","v":""},"","","","","","","","","","","","","","","","","","","","","","","","",null,"","",null,{"$f":"IF($Y28<=$D$10,IF(COLUMN()<26+$D$12,\"\",OFFSET(IC28,0,-$D$12,1,1)),\"\")","v":""},"",null,{"$f":"IF($Y28<=$D$10,IF(COLUMN()<26+$D$12,\"\",OFFSET(IF28,0,-$D$12,1,1)),\"\")","v":""},"",null,{"$f":"IF($Y28<=$D$10,IF(COLUMN()<26+$D$12,\"\",OFFSET(II28,0,-$D$12,1,1)),\"\")","v":""},"",null,{"$f":"IF($Y28<=$D$10,IF(COLUMN()<26+$D$12,\"\",OFFSET(IL28,0,-$D$12,1,1)),\"\")","v":""},"",null,{"$f":"IF($Y28<=$D$10,IF(COLUMN()<26+$D$12,\"\",OFFSET(IO28,0,-$D$12,1,1)),\"\")","v":""},"",null,{"$f":"IF($Y28<=$D$10,IF(COLUMN()<26+$D$12,\"\",OFFSET(IR28,0,-$D$12,1,1)),\"\")","v":""},"",null,{"$f":"IF($Y28<=$D$10,IF(COLUMN()<26+$D$12,\"\",OFFSET(IU28,0,-$D$12,1,1)),\"\")","v":""},"",null,{"$f":"IF($Y28<=$D$10,IF(COLUMN()<26+$D$12,\"\",OFFSET(IX28,0,-$D$12,1,1)),\"\")","v":""},"",null,{"$f":"IF($Y28<=$D$10,IF(COLUMN()<26+$D$12,\"\",OFFSET(JA28,0,-$D$12,1,1)),\"\")","v":""},"",null,{"$f":"IF($Y28<=$D$10,IF(COLUMN()<26+$D$12,\"\",OFFSET(JD28,0,-$D$12,1,1)),\"\")","v":""},"",null,{"$f":"IF($Y28<=$D$10,IF(COLUMN()<26+$D$12,\"\",OFFSET(JG28,0,-$D$12,1,1)),\"\")","v":""},"",null,{"$f":"IF($Y28<=$D$10,IF(COLUMN()<26+$D$12,\"\",OFFSET(JJ28,0,-$D$12,1,1)),\"\")","v":""},"",null,{"$f":"IF($Y28<=$D$10,IF(COLUMN()<26+$D$12,\"\",OFFSET(JM28,0,-$D$12,1,1)),\"\")","v":""},""]
[null,"Best # Zones","Takt Time","Duration",null,3,27,5,15,27,0.92592592592592593,37.962962962962962,15,1,{"$f":"_xlfn.IFS(T30<=0.3,\"Bad\",AND(T30<0.5,T30>0.3),\"Macro\",T30>=0.5,\"Norm\")","v":"Norm"},41,0.88888888888888884,2,1830.5555555555557,0.95121951219512191,0.55555555555555558,0.57692307692307687,"",null,27,"","","","","","","","","","","","","","","","","","","","","","","","","","","","","","","","","","","","","","","","","","","","","","","","",{"$f":"IF($Y29<=$D$10,IF(COLUMN()<26+$D$12,\"\",OFFSET(BV29,0,-$D$12,1,1)),\"\")","v":""},"","","","","","","","","","","","","","","","","","","","","","","","","","","","","","","","","","","","","","","","","","","","","","",{"$f":"IF($Y29<=$D$10,IF(COLUMN()<26+$D$12,\"\",OFFSET(DQ29,0,-$D$12,1,1)),\"\")","v":""},"","","","","","","","","","","","","","","","","","","","","","","","","","","","","","","","","","","","","","","","","","","","","","","","","","","","","","","","","","","","","","","",{"$f":"IF($Y29<=$D$10,IF(COLUMN()<26+$D$12,\"\",OFFSET(GC29,0,-$D$12,1,1)),\"\")","v":""},"","","","","","","","","","","","","","","","","","","","","","","","","","","","","","","","","","","","","","","","","","","","","","","",null,"","",null,"","",null,"","",null,"","",null,"","",null,"","",null,"","",null,"","",null,"","",null,"","",null,"","",null,"","",null,"","",null,"",""]
[null,{"$f":"IFERROR(ROUNDUP($D$10*$D$12*1/C31,0),\"\")","v":25},{"$f":"IF($D$12=\"\",\"\",$D$12/$D$12)","v":1},{"$f":"IFERROR(($D$8+B31-1)*C31,\"\")","v":39},null,3,28,5,15,28,0.8928571428571429,37.5,15,1,{"$f":"_xlfn.IFS(T31<=0.3,\"Bad\",AND(T31<0.5,T31>0.3),\"Macro\",T31>=0.5,\"Norm\")","v":"Norm"},42,0.8571428571428571,3,1765.1785714285713,0.9285714285714286,0.5357142857142857,0.55555555555555558,"",null,28,"","","","","","","","","","","","","","","","","","","","","","","","","","","","","","","","",{"$f":"IF($Y30<=$D$10,IF(COLUMN()<26+$D$12,\"\",OFFSET(BF30,0,-$D$12,1,1)),\"\")","v":""},"","","","","","","","","","","","","","","","","","","","","","","","","","","","","","","","","","","","","","","","","","","","","","","","","","","","","","","","","","","","","","","","","","","","","","","","","","","","","","","","","","","","","","","","","","","","","","","","","","","","","","","","","","","","","","","","","","","","","","","","","","","","","","","","","","","","","","","","","","","","","","","","","","","","","","","","","","","","","","","","","","","","","","","","","","","","","","",null,"","",null,"","",null,"","",null,"","",null,"","",null,"","",null,"","",null,"","",null,"","",null,"","",null,"","",null,"","",null,"","",null,"",""]
[null,13,{"$f":"IFERROR(C31+1,\"\")","v":2},54,null,3,29,5,15,29,0.86206896551724133,37.068965517241374,15,1,{"$f":"_xlfn.IFS(T32<=0.3,\"Bad\",AND(T32<0.5,T32>0.3),\"Macro\",T32>=0.5,\"Norm\")","v":"Norm"},43,0.82758620689655171,4,1704.3103448275863,0.90697674418604646,0.51724137931034486,0.5357142857142857,"",null,29,"","","","","","","","","","","","","","","","","","","","","","","","","","","","","","","","","","","","","","","","","","","","","","","","","","","","","","","","","","","","","","","","",{"$f":"IF($Y31<=$D$10,IF(COLUMN()<26+$D$12,\"\",OFFSET(CL31,0,-$D$12,1,1)),\"\")","v":""},"","","","","","","","","","","","","","","","","","","","","","","","","","","","","","","","","","","","","","","","","","","","","","","","","","","","","","","","","","","","","","","","","","","","","",{"$f":"IF($Y31<=$D$10,IF(COLUMN()<26+$D$12,\"\",OFFSET(FD31,0,-$D$12,1,1)),\"\")","v":""},"","","","","","","","","","","","","","","","","","","","","","","","","","","","","","","","","","","","","","","","","","","","","","","","","","","","","","","","","","","","","","","",{"$f":"IF($Y31<=$D$10,IF(COLUMN()<26+$D$12,\"\",OFFSET(HP31,0,-$D$12,1,1)),\"\")","v":""},"","","","","","","","",null,"","",null,"","",null,"","",null,"","",null,"","",null,"","",null,"","",null,"","",null,"","",null,"","",null,"","",null,"","",null,"","",null,"",""]
[null,9,{"$f":"IFERROR(C32+1,\"\")","v":3},69,null,3,30,5,15,30,0.83333333333333337,36.666666666666671,15,1,{"$f":"_xlfn.IFS(T33<=0.3,\"Bad\",AND(T33<0.5,T33>0.3),\"Macro\",T33>=0.5,\"Norm\")","v":"Norm"},44,0.8,5,1647.5,0.88636363636363635,0.5,0.51724137931034486,"",null,30,"","","","","","","","","","","","","","","","","","","","","","","","","","","","","","","","","","","","","","","","","","","","","","","","","","","","","","","","","","","","","","","","","","","","","","","","","","","","","","","","","","","","","","","","","","","","","","","","","","","","","","","","","","","","","","","","","","","","","","","","","","","","","","","","","","","","","","","","","","","","","","","","","","","","","","","","","","","","","","","","","","","","","","","","","","","","","","","","","","","","","","","","","","","","","","","","","","","","","","","","","","","","","","","",null,"","",null,"","",null,"","",null,"","",null,"","",null,"","",null,"","",null,"","",null,"","",null,"","",null,"","",null,"","",null,"","",null,"",""]
[null,7,4,84,null,3,31,5,15,31,0.80645161290322576,36.29032258064516,15,1,{"$f":"_xlfn.IFS(T34<=0.3,\"Bad\",AND(T34<0.5,T34>0.3),\"Macro\",T34>=0.5,\"Norm\")","v":"Norm"},45,0.77419354838709675,6,1594.3548387096773,0.8666666666666667,0.4838709677419355,0.5,"",null,31,"","","","","","","","","","","","","","","","","","","","","","","","","","","","","","","","","","","","","","","","","","","","","","","","","","","","","","","","","","","","","","","","","","","","","","","","","","","","","","","","","","","","","","","","","","","","","","","","","","","","","","","","","","","","","","","","","","","","","","","","","","","","","","","","","","","","","","","","","","","","","","","","","","","","","","","","","","","","","","","","","","","","","","","","","","","","","","","","","","","","","","","","","","","","","","","","","","","","","","","","","","","","","","","",null,"","",null,"","",null,"","",null,"","",null,"","",null,"","",null,"","",null,"","",null,"","",null,"","",null,"","",null,"","",null,"","",null,"",""]
[null,5,5,95,null,3,32,5,15,32,0.78125,35.9375,15,1,{"$f":"_xlfn.IFS(T35<=0.3,\"Bad\",AND(T35<0.5,T35>0.3),\"Macro\",T35>=0.5,\"Norm\")","v":"Norm"},46,0.75,7,1544.53125,0.84782608695652173,0.46875,0.4838709677419355,"",null,32,"","","","","","","","","","","","","","","","","","","","","","","","","","","","","","","","","","","","","","","","","","","","","","","","","","","","","","","","","","","","","","","","","","","","","","","","","","","","","","","","","","","","","","","","","","","","","","","","","","","","","","","","","","","","","","","","","","","","","","","","","","","","","","","","","","","","","","","","","","","","","","","","","","","","","","","","","","","","","","","","","","","","","","","","","","","","","","","","","","","","","","","","","","","","","","","","","","","","","","","","","","","","","","","",null,"","",null,"","",null,"","",null,"","",null,"","",null,"","",null,"","",null,"","",null,"","",null,"","",null,"","",null,"","",null,"","",null,"",""]
[null,5,6,114,null,3,33,5,15,33,0.75757575757575757,35.606060606060609,15,1,{"$f":"_xlfn.IFS(T36<=0.3,\"Bad\",AND(T36<0.5,T36>0.3),\"Macro\",T36>=0.5,\"Norm\")","v":"Norm"},47,0.72727272727272729,8,1497.7272727272727,0.82978723404255317,0.45454545454545453,0.46875,"",null,33,"","","","","","","","","","","","","","","","","","","","","","","","","","","","","","","","","","","","","","","","","","","","","","","","","","","","","","","","","","","","","","","","","","","","","","","","","","","","","","","","","","","","","","","","","","","","","","","","","","","","","","","","","","","","","","","","","","","","","","","","","","","","","","","","","","","","","","","","","","","","","","","","","","","","","","","","","","","","","","","","","","","","","","","","","","","","","","","","","","","","","","","","","","","","","","","","","","","","","","","","","","","","","","","",null,"","",null,"","",null,"","",null,"","",null,"","",null,"","",null,"","",null,"","",null,"","",null,"","",null,"","",null,"","",null,"","",null,"",""]
[null,4,7,126,null,3,34,5,15,34,0.73529411764705888,35.294117647058826,15,1,{"$f":"_xlfn.IFS(T37<=0.3,\"Bad\",AND(T37<0.5,T37>0.3),\"Macro\",T37>=0.5,\"Norm\")","v":"Norm"},48,0.70588235294117652,9,1453.6764705882354,0.8125,0.44117647058823528,0.45454545454545453,"",null,34,"","","","","","","","","","","","","","","","","","","","","","","","","","","","","","","","","","","","","","","","","","","","","","","","","","","","","","","","","","","","","","","","","","","","","","","","","","","","","","","","","","","","","","","","","","","","","","","","","","","","","","","","","","","","","","","","","","","","","","","","","","","","","","","","","","","","","","","","","","","","","","","","","","","","","","","","","","","","","","","","","","","","","","","","","","","","","","","","","","","","","","","","","","","","","","","","","","","","","","","","","","","","","","","",null,"","",null,"","",null,"","",null,"","",null,"","",null,"","",null,"","",null,"","",null,"","",null,"","",null,"","",null,"","",null,"","",null,"",""]
[null,4,8,144,null,3,35,5,15,35,0.7142857142857143,35,15,1,{"$f":"_xlfn.IFS(T38<=0.3,\"Bad\",AND(T38<0.5,T38>0.3),\"Macro\",T38>=0.5,\"Norm\")","v":"Norm"},49,0.68571428571428572,10,1412.1428571428571,0.79591836734693877,0.42857142857142855,0.44117647058823528,"",null,35,{"$f":"IF($Y37<=$D$10,IF(COLUMN()<26+$D$12,\"\",OFFSET(Z37,0,-$D$12,1,1)),\"\")","v":""},"","","","","","","","","","","","","","","","","","","","","","","","","","","","","","","","","","","","","","","","","","","","","","","","","","","","","","","","","","","","","","","","","","","","","","","","","","","","","","","","","","","","","","","","","","","","","","","","","","","","","","","","","","","","","","","","","","","","","","","","","","","","","","","","","","","","","","","","","","","","","","","","","","","","","","","","","","","","","","","","","","","","","","","","","","","","","","","","","","","","","","","","","","","","","","","","","","","","","","","","","","","","","","",null,"","",null,"","",null,"","",null,"","",null,"","",null,"","",null,"","",null,"","",null,"","",null,"","",null,"","",null,"","",null,"","",null,"",""]
[null,3,9,153,null,3,36,5,15,36,0.69444444444444442,34.722222222222221,15,1,{"$f":"_xlfn.IFS(T39<=0.3,\"Bad\",AND(T39<0.5,T39>0.3),\"Macro\",T39>=0.5,\"Norm\")","v":"Norm"},50,0.66666666666666663,11,1372.9166666666667,0.78,0.41666666666666669,0.42857142857142855,"",null,36,"","","","","","","","","","","","","","","","","","","","","","","","","","","","","","","","","","","","","","","","","","","","","","","","","","","","","","","","","","","","","","","","","","","","","","","","","","","","","","","","",{"$f":"IF($Y38<=$D$10,IF(COLUMN()<26+$D$12,\"\",OFFSET(DB38,0,-$D$12,1,1)),\"\")","v":""},"","","","","","","","","","","","","","","","","","","","","","","","","","","","","","","","","","","","","","","","","","","","","","","","","","","","","","","","","","","","","","","","","","","","","",{"$f":"IF($Y38<=$D$10,IF(COLUMN()<26+$D$12,\"\",OFFSET(FT38,0,-$D$12,1,1)),\"\")","v":""},"","","","","","","","","","","","","","","","","","","","","","","","","","","","","","","","","","","","","","","","","","","","","","","","","","","","","","","","","","","","","","","","","","","","","","","","","","","","","","","","","","","","","","","","","","","","","","","","","","",""]
[null,3,10,170,null,3,{"$f":"IFERROR(G39+1,\"\")","v":37},5,15,37,0.67567567567567566,34.45945945945946,15,1,{"$f":"_xlfn.IFS(T40<=0.3,\"Bad\",AND(T40<0.5,T40>0.3),\"Macro\",T40>=0.5,\"Norm\")","v":"Norm"},51,0.64864864864864868,12,1335.8108108108108,0.76470588235294112,0.40540540540540543,0.41666666666666669,"x",null,37,"","","","","","","","","","","","","","","","","","","","","","","","","","","","","","","","","","","","","","","","","","","","","","","","","","","","","","","","","","","","","","","","","","","","","","","","","","","","","","","","","","","","","","","","","","","","","","","","","","","","","","","","","","","","","","","","","","","","","","","","","","","","","","","","","","","","","","","","","","","","","","","","","","","","","","","","","","","","","","","","","","","","","","","","","","","","","","","","","","","","","","","","","","","","","","","","","","","","","","","","","","","","","","","","","","","","","","","","","","","","","","","","","","","","","","","","","","","","","","","","","","","","","","","","","",""]
[null,null,null,null,null,null,null,null,null,null,null,null,null,null,null,null,null,null,null,null,null,null,null,null,38,"Wagons",null,null,null,{"$f":"IF(D8=\"\",\"\",D8)","v":15},null,"","","","","","","","","","","","","","","","","","","","","","","","","","","","","","","","","","","","","","","","","","","","","","","","","","","","","","","","","","","","","","","","","","","","","","","","","","","","","","","","","","","","","","","","","","","","","","","","","","","","","","","","","","","","","","","","","","","","","","","","","","","","","","","","","","","","","","","","","","","","","","","","","","","","","","","","","","","","","","","","","","","","","","","","","","","","","","","","","","","","","","","","","","","","","","","","","","","","","","","","","","","","","","","","","","","","","","","","","","","","","","","","","","","","","","","","","","","","","","","","","","","",""]
[null,null,null,null,null,null,null,null,null,null,null,null,null,null,null,null,null,null,null,null,null,null,null,null,39,"Zones",null,null,null,{"$f":"IF(D10=\"\",\"\",D10)","v":5},null,"","","","","","","","","","",{"$f":"IF($Y41<=$D$10,IF(COLUMN()<26+$D$12,\"\",OFFSET(AP41,0,-$D$12,1,1)),\"\")","v":""},"","","","","","","","","","","","","","","","","","","","","","","","","","","","","","","","","","","","","","","","","","","","","","","","","","","","","","","","","","","","","","","","","","","","","","","","","","","","","","","","","",{"$f":"IF($Y41<=$D$10,IF(COLUMN()<26+$D$12,\"\",OFFSET(DT41,0,-$D$12,1,1)),\"\")","v":""},"","","","","","","","","","","","","","","","","","","","","","","","","","","","","","","","","","","","","","","","","","","","","","","","","","","","","","","","","","","","","","","","","","","","","","","","","","","","","","","","","","","","","","","","","","","","","","","","","","","","","","","","","","","","","","","","","","","","","","","","","","","","","","","","","","","","","","","","","","","","","","","","","","","","","","",""]
[null,null,null,null,null,null,null,null,null,null,null,null,null,null,null,null,null,null,null,null,null,null,null,null,40,"Takt Time",null,null,null,{"$f":"IF(D12=\"\",\"\",D12)","v":5},null,"","","","","","","","","","","","","","","","","","","","","","","","","","","","","","","","","","","","","","","","","","","","","","","","","","","","","","","","","","","","","","","","","","","","","","","","","","","","","","","","","","","","","","","","","","","","","","","","","","","","","","","","","","","","","","","","","","","","","","","","","","","","","","","","","","","","","","","","","","","","","","","","","","","","","","","","","","","","","","","","","","","","","","","","","",{"$f":"IF($Y42<=$D$10,IF(COLUMN()<26+$D$12,\"\",OFFSET(GS42,0,-$D$12,1,1)),\"\")","v":""},"","","","","","","","","","","","","","","","","","","","","","","","","","","","","","","","","","","","","","","","","","","","","","","","","","","","","","","","","","","","","","","","","","","","","","","","","",""]
[]
[]
[null,null,null,null,null,null,null,null,null,null,null,null,null,null,null,null,null,null,null,null,null,null,null,null,null,1,2,3,4,5,6,7,8,9,10,11,12,13,14,15,16,17,18,19,20,21,22,23,24,25,26,27,28,29,30,31,32,33,34,35,36,37,38,39,40,41,42,43,44,45,46,47,48,49,50,51,52,53,54,55,56,57,58,59,60,61,62,63,64,65,66,67,68,69,70,71,72,73,74,75,76,77,78,79,80,81,82,83,84,85,86,87,88,89,90,91,92,93,94,95,96,97,98,99,100,101,102,103,104,105,106,107,108,109,110,111,112,113,114,115,116,117,118,119,120,121,122,123,124,125,126,127,128,129,130,131,132,133,134,135,136,137,138,139,140,141,142,143,144,145,146,147,148,149,150,151,152,153,154,155,156,157,158,159,160,161,162,163,164,165,166,167,168,169,170,171,172,173,174,175,176,177,178,179,180,181,182,183,184,185,186,187,188,189,190,191,192,193,194,195,196,197,198,199,200,201,202,203,204,205,206,207,208,209,210,211,212,213,214,215,216,217,218,219,220,221,222,223,224,225,226,227,228,229,230,231,232,233,234,235,236,237,238,239,240,241,242,243,244,245,246,247,248,249,250]
[null,null,null,null,null,null,null,null,null,null,null,null,null,null,null,null,null,null,null,null,null,null,null,null,1,{"$f":"IFERROR(\n  _xlfn.LET(\n    _xlpm.val, $AD$86 / Z46,\n    _xlpm.n, ROUNDUP(1 / _xlpm.val, 0),\n    IF(_xlpm.n > $AD$84, \"\", _xlpm.n)\n  ),\n\"\")","v":1},{"$f":"IFERROR(\n  _xlfn.LET(\n    _xlpm.val, $AD$86 / AA46,\n    _xlpm.n, ROUNDUP(1 / _xlpm.val, 0),\n    IF(_xlpm.n > $AD$84, \"\", _xlpm.n)\n  ),\n\"\")","v":2},3,4,5,6,7,8,9,10,11,12,13,14,15,"","","","","","","","","","","","","","","","","","","","","","","","","","","","","","","","","","","","","","","","","","","","","","","","","","",{"$f":"IFERROR(\n  _xlfn.LET(\n    _xlpm.val, $AD$86 / CM46,\n    _xlpm.n, ROUNDUP(1 / _xlpm.val, 0),\n    IF(_xlpm.n > $AD$84, \"\", _xlpm.n)\n  ),\n\"\")","v":""},"","","","","","","","","","","","","","","","","","","","","","","","","","","","","","","","","","","","","","","","","","","","","","","","","","","","","","","","","","","","","","","",{"$f":"IFERROR(\n  _xlfn.LET(\n    _xlpm.val, $AD$86 / EY46,\n    _xlpm.n, ROUNDUP(1 / _xlpm.val, 0),\n    IF(_xlpm.n > $AD$84, \"\", _xlpm.n)\n  ),\n\"\")","v":""},"","","","","","","","","","","","","","","","","","","","","","","","","","","","","","","","","","","","","","","","","","","","","","","","","","","","","","","","","","","","","","","",{"$f":"IFERROR(\n  _xlfn.LET(\n    _xlpm.val, $AD$86 / HK46,\n    _xlpm.n, ROUNDUP(1 / _xlpm.val, 0),\n    IF(_xlpm.n > $AD$84, \"\", _xlpm.n)\n  ),\n\"\")","v":""},"","","","","","","","","","","","","","","","","","","","","","","","","","","","","","","","","","","","","","","","","","","","","","","","","","","","","","","",""]
[null,null,null,null,null,null,null,null,null,null,null,null,null,null,null,null,null,null,null,null,null,null,null,null,2,{"$f":"IFERROR(IF($Y48<=$AD$85,IF(COLUMN()<26+$AD$86,\"\",OFFSET(Z47,0,-$AD$86,1,1)),\"\"),\"\")","v":""},1,2,3,4,5,6,7,8,9,10,11,12,13,14,15,"","","","","","","","","","","","","","","","","","","","","","","","","","","","","","","","","","","","","","","","","","","","","","","","",{"$f":"IFERROR(IF($Y48<=$AD$85,IF(COLUMN()<26+$AD$86,\"\",OFFSET(CL47,0,-$AD$86,1,1)),\"\"),\"\")","v":""},"","","","","","","","","","","","","","","","","","","","","","","","","","","","","","","","","","","","","","","","","","","","","","","","","","","","","","","","","","","","","","","",{"$f":"IFERROR(IF($Y48<=$AD$85,IF(COLUMN()<26+$AD$86,\"\",OFFSET(EX47,0,-$AD$86,1,1)),\"\"),\"\")","v":""},"","","","","","","","","","","","","","","","","","","","","","","","","","","","","","","","","","","","","","","","","","","","","","","","","","","","","","","","","","","","","","","",{"$f":"IFERROR(IF($Y48<=$AD$85,IF(COLUMN()<26+$AD$86,\"\",OFFSET(HJ47,0,-$AD$86,1,1)),\"\"),\"\")","v":""},"","","","","","","","","","","","","","","","","","","","","","","","","","","","","","","","","","","","","","","","","","","","","","","","","","","","","","","","",""]
[null,null,null,null,null,null,null,null,null,null,null,null,null,null,null,null,null,null,null,null,null,null,null,null,3,"","",1,2,3,4,5,6,7,8,9,10,11,12,13,14,15,"","","","","","","","","","","","","","","","","","","","","","","","","","","","","","","","","","","","","","","","","","","","","","","","","","","","","","","","","","","","","","","","","","","","","","","","","","","","","","","","","","","","","","","","","","","","","","","","","","","","","","","","","","","","","","","","","","","","","","","","","","","","","","","","","","","","","","","","","","","","","","","","","","","","","","","","","","","","","","","","","","","","","","","","","","","","","","","","","","","","","","","","","","","","","","","","","","","","","","","","","","","","","","","","","","","","","","","","","","","","","","","","","","","","","","","","",""]
[null,null,null,null,null,null,null,null,null,null,null,null,null,null,null,null,null,null,null,null,null,null,null,null,4,"","","",1,2,3,4,5,6,7,8,9,10,11,12,13,14,15,"","","","","","","","","","","","","","","","","","","","","","","","","","","","","","","","","","","","","","","","","","","","","","","","","","","","","","","","","","","","","","","","","","","","","","","","","","","","","","","","","","","","","","","","","","","","","","","","","","","","","","","","","","","","","","","","","","","","","","","","","","","","","","","","","","","","","","","","","","","","","","","","","","","","","","","","","","","","","","","","","","","","","","","","","","","","","","","","","","","","","","","","","","","","","","","","","","","","","","","","","","","","","","","","","","","","","","","","","","","","","","","","","","","","","","","",""]
[null,null,null,null,null,null,null,null,null,null,null,null,null,null,null,null,null,null,null,null,null,null,null,null,5,"","","","",1,2,3,4,5,6,7,8,9,10,11,12,13,14,15,"","","","","","","","","","","","","","","","","","","","","","","","","","","","","","","","","","","","","","","","","","","","",{"$f":"IFERROR(IF($Y51<=$AD$85,IF(COLUMN()<26+$AD$86,\"\",OFFSET(CK50,0,-$AD$86,1,1)),\"\"),\"\")","v":""},"","","","","","","","","","","","","","","","","","","","","","","","","","","","","","","","","","","","","","","","","","","","","","","","","","","","","","","","","","","","","","","",{"$f":"IFERROR(IF($Y51<=$AD$85,IF(COLUMN()<26+$AD$86,\"\",OFFSET(EW50,0,-$AD$86,1,1)),\"\"),\"\")","v":""},"","","","","","","","","","","","","","","","","","","","","","","","","","","","","","","","","","","","","","","","","","","","","","","","","","","","","","","","","","","","","","","",{"$f":"IFERROR(IF($Y51<=$AD$85,IF(COLUMN()<26+$AD$86,\"\",OFFSET(HI50,0,-$AD$86,1,1)),\"\"),\"\")","v":""},"","","","","","","","","","","","","","","",null,"","","",null,"","","",null,"","","",null,"","","",null,"","","",null,"","","",null,"","","",null,"","","",null,"","","",null,"","",null,"","",""]
[null,null,null,null,null,null,null,null,null,null,null,null,null,null,null,null,null,null,null,null,null,null,null,null,6,{"$f":"IFERROR(IF($Y52<=$AD$85,IF(COLUMN()<26+$AD$86,\"\",OFFSET(Z51,0,-$AD$86,1,1)),\"\"),\"\")","v":""},"","","","",1,2,3,4,5,6,7,8,9,10,11,12,13,14,15,"","","","","","","","","","","","","","","","","","","","","","","","","","","","","","","","","","","","","","","","","","","","","","","","","","","","","","","","","","","",{"$f":"IFERROR(IF($Y52<=$AD$85,IF(COLUMN()<26+$AD$86,\"\",OFFSET(DA51,0,-$AD$86,1,1)),\"\"),\"\")","v":""},"","","","","","","","","","","","","","","","","","","","","","","","","","","","","","","","","","","","","","","","","","","","","","","","","","","","","","","","","","","","","","","",{"$f":"IFERROR(IF($Y52<=$AD$85,IF(COLUMN()<26+$AD$86,\"\",OFFSET(FM51,0,-$AD$86,1,1)),\"\"),\"\")","v":""},"","","","","","","","","","","","","","","","","","","","","","","","","","","","","","","","","","","","","","","","","","","","","","","","","","","","","","","","","","","","","","","",null,0,"","",null,0,"","",null,0,"","",null,0,"","",null,0,"","",null,0,"","",null,0,{"$f":"IFERROR(IF($Y52<=$AD$85,IF(COLUMN()<26+$AD$86,\"\",OFFSET(IY51,0,-$AD$86,1,1)),\"\"),\"\")","v":""},"",null,{"$f":"IFERROR(IF($Y52<=$AD$85,IF(COLUMN()<26+$AD$86,\"\",OFFSET(JB51,0,-$AD$86,1,1)),\"\"),\"\")","v":0},"","",null,{"$f":"IFERROR(IF($Y52<=$AD$85,IF(COLUMN()<26+$AD$86,\"\",OFFSET(JF51,0,-$AD$86,1,1)),\"\"),\"\")","v":0},"","",null,{"$f":"IFERROR(IF($Y52<=$AD$85,IF(COLUMN()<26+$AD$86,\"\",OFFSET(JJ51,0,-$AD$86,1,1)),\"\"),\"\")","v":0},"",null,{"$f":"IFERROR(IF($Y52<=$AD$85,IF(COLUMN()<26+$AD$86,\"\",OFFSET(JM51,0,-$AD$86,1,1)),\"\"),\"\")","v":0},"",""]
[null,null,null,null,null,null,null,null,null,null,null,null,null,null,null,null,null,null,null,null,null,null,null,null,7,"","","","","","",1,2,3,4,5,6,7,8,9,10,11,12,13,14,15,"","","","","","","","","","","","","","","","","","","","","","","","","","","","","","","","","","","","","","","","","","","","","","","","","","","","","","","","","","","","","","","","","","","","","","","","","","","","","","","","","","","","","","","","","","","","","","","","","","","","","","","","","","","","","","","","","","","","","","","","","","","","","","","","","","","","","","","","","","","","","","","","","","","","","","","","","","","","","","","","","","","","","","","","","","","","","","","","","","","","","","","","","","",null,{"$f":"IFERROR(IF($Y53<=$AD$85,IF(COLUMN()<26+$AD$86,\"\",OFFSET(HZ52,0,-$AD$86,1,1)),\"\"),\"\")","v":0},0,"",null,{"$f":"IFERROR(IF($Y53<=$AD$85,IF(COLUMN()<26+$AD$86,\"\",OFFSET(ID52,0,-$AD$86,1,1)),\"\"),\"\")","v":0},0,"",null,{"$f":"IFERROR(IF($Y53<=$AD$85,IF(COLUMN()<26+$AD$86,\"\",OFFSET(IH52,0,-$AD$86,1,1)),\"\"),\"\")","v":0},0,"",null,{"$f":"IFERROR(IF($Y53<=$AD$85,IF(COLUMN()<26+$AD$86,\"\",OFFSET(IL52,0,-$AD$86,1,1)),\"\"),\"\")","v":0},0,"",null,{"$f":"IFERROR(IF($Y53<=$AD$85,IF(COLUMN()<26+$AD$86,\"\",OFFSET(IP52,0,-$AD$86,1,1)),\"\"),\"\")","v":0},0,"",null,{"$f":"IFERROR(IF($Y53<=$AD$85,IF(COLUMN()<26+$AD$86,\"\",OFFSET(IT52,0,-$AD$86,1,1)),\"\"),\"\")","v":0},0,"",null,{"$f":"IFERROR(IF($Y53<=$AD$85,IF(COLUMN()<26+$AD$86,\"\",OFFSET(IX52,0,-$AD$86,1,1)),\"\"),\"\")","v":0},0,"",null,0,0,"",null,0,0,"",null,0,0,null,0,0,""]
[null,null,null,null,null,null,null,null,null,null,null,null,null,null,null,null,null,null,null,null,null,null,null,null,8,"","","","","","","",1,2,3,4,5,6,7,8,9,10,11,12,13,14,15,"","","","","","","","","","","","","","","","","","","","","","","","","","","","","","","","","","","","","","","","","","","","","","","","","","","","","","","","","","","","","","","","","","","","","","","","","","","","","","","","","","","","","","","","","","","","","","","","","","","","","","","","","","","","","","","","","","","","","","","","","","","","","","","","","","","","","","","","","","","","","","","","","","","","","","","","","","","","","","","","","","","","","","","","","","","","","","","","","","","","","","","","","",null,0,0,0,null,0,0,0,null,0,0,0,null,0,0,0,null,0,0,0,null,0,0,0,null,0,0,0,null,0,0,0,null,0,0,0,null,0,0,null,0,0,0]
[null,null,null,null,null,null,null,null,null,null,null,null,null,null,null,null,null,null,null,null,null,null,null,null,9,"","","","","","","","",1,2,3,4,5,6,7,8,9,10,11,12,13,14,15,"","","","","","","","","","","","","","","","","","","","","","","","","","","","","","","","","","","","","","","","","","","","","","","","","","","","","","","","","","","","","","","","","","","","","","","","","","","","","","","","","","","","","","","","","","","","","","","","","","","","","","","","","","","","","","","","","","","","","","","","","","","","","","","","","","","","","","","","","","","","","","","","","","","","","","","","","","","","","","","","","","","","","","","","","","","","","","","","","","","","","","","","",null,0,0,0,null,0,0,0,null,0,0,0,null,0,0,0,null,0,0,0,null,0,0,0,null,0,0,0,null,0,0,0,null,0,0,0,null,0,0,null,0,0,0]
[null,null,null,null,null,null,null,null,null,null,null,null,null,null,null,null,null,null,null,null,null,null,null,null,10,"","","",{"$f":"IFERROR(IF($Y56<=$AD$85,IF(COLUMN()<26+$AD$86,\"\",OFFSET(AC55,0,-$AD$86,1,1)),\"\"),\"\")","v":""},"","","","","",1,2,3,4,5,6,7,8,9,10,11,12,13,14,15,"","","","","","","","","","","","","","","","","","","","","","","","","","","","","","","","","","","","","","","","","","","","","","","","","","","","","","","","","","","","","","","","","","","","","","","","","","","","","","","","","","","","","","","","","","","","","","","","","","","","","","","","","","","","","","","","","","","","","","","","","","","","","","","","","","","","","","","","","","","","","","","","","","","","","","","","","","","","","","","","","","","","","","","","","","","","","","","","","","","","","","","",null,0,0,0,null,0,0,0,null,0,0,0,null,0,0,0,null,0,0,0,null,0,0,0,null,0,0,0,null,0,0,0,null,0,0,0,null,0,0,null,0,0,0]
[null,null,null,null,null,null,null,null,null,null,null,null,null,null,null,null,null,null,null,null,null,null,null,null,11,"","","","","","","","","","",1,2,3,4,5,6,7,8,9,10,11,12,13,14,15,"","","","","","","","","","","","","","","","","","","","","","","","","","","","","","","","","","","","","","","","","","","","","","","","","","","","","","","","","","","","","","","","","","","","","",{"$f":"IFERROR(IF($Y57<=$AD$85,IF(COLUMN()<26+$AD$86,\"\",OFFSET(DP56,0,-$AD$86,1,1)),\"\"),\"\")","v":""},"","","","","","","","","","","","","","","","","","","","","","","","","","","","","","","","","","","","","","","","","","","","","","","","","","","","","","","","","","","","","","","",{"$f":"IFERROR(IF($Y57<=$AD$85,IF(COLUMN()<26+$AD$86,\"\",OFFSET(GB56,0,-$AD$86,1,1)),\"\"),\"\")","v":""},"","","","","","","","","","","","","","","","","","","","","","","","","","","","","","","","","","","","","","","","","","","","","","","","",null,0,0,0,null,0,0,0,null,0,0,0,null,0,0,0,null,0,0,0,null,0,0,0,null,0,0,0,null,0,0,0,null,0,0,0,null,0,0,null,0,0,0]
[null,null,null,null,null,null,null,null,null,null,null,null,null,null,null,null,null,null,null,null,null,null,null,null,12,"","","","","","","","","","","",1,2,3,4,5,6,7,8,9,10,11,12,13,14,15,"","","","","","","","","","","","","","","","","","","","","","","","","","","","","","","","","","","","","","","","","","","","","","","","","","","","","",{"$f":"IFERROR(IF($Y58<=$AD$85,IF(COLUMN()<26+$AD$86,\"\",OFFSET(DA57,0,-$AD$86,1,1)),\"\"),\"\")","v":""},"","","","","","","","","","","","","","","","","","","","","","","","","","","","","","","","","","","","","","","","","","","","","","","","","","","","","","","","","","","","","","","",{"$f":"IFERROR(IF($Y58<=$AD$85,IF(COLUMN()<26+$AD$86,\"\",OFFSET(FM57,0,-$AD$86,1,1)),\"\"),\"\")","v":""},"","","","","","","","","","","","","","","","","","","","","","","","","","","","","","","","","","","","","","","","","","","","","","","","","","","","","","","","","","","","","","","",null,0,0,0,null,0,0,0,null,0,0,0,null,0,0,0,null,0,0,0,null,0,0,0,null,0,0,0,null,0,0,0,null,0,0,0,null,0,0,null,0,0,0]
[null,null,null,null,null,null,null,null,null,null,null,null,null,null,null,null,null,null,null,null,null,null,null,null,13,"","","","","","","","","","","","",1,2,3,4,5,6,7,8,9,10,11,12,13,14,15,"","","","","","","","","","","","","","","","","","","","","","","","","","","","","","","","","","","","","","","","","","","","","","","","","","","","","","","","","","","","","","","","","","","","","","","","","","","","","","","","","","","","","","","","","","","","","","","","","","","","","","","","","","","","","","","","","","","","","","","","","","","","","","","","","","","","","","","","","","","","","","","","","","","","","","","","","","","","","","","","","","","","","","","","","","","","","","","","","","","","",null,0,0,0,null,0,0,0,null,0,0,0,null,0,0,0,null,0,0,0,null,0,0,0,null,0,0,0,null,0,0,0,null,0,0,0,null,0,0,null,0,0,0]
[null,null,null,null,null,null,null,null,null,null,null,null,null,null,null,null,null,null,null,null,null,null,null,null,14,"","","","","","",{"$f":"IFERROR(IF($Y60<=$AD$85,IF(COLUMN()<26+$AD$86,\"\",OFFSET(AF59,0,-$AD$86,1,1)),\"\"),\"\")","v":""},"","","","","","",1,2,3,4,5,6,7,8,9,10,11,12,13,14,15,"","","","","","","","","","","","","","","","","","","","","","","","","","","","","","","","","","","","","","","","","","","","","","","","","","","","","","","","","","","","","","","","","","","","","","","","","","","","","","","","","","","","","","","","","","","","","","","","","","","","","","","","","","","","","","","","","","","","","","","","","","","","","","","","","","","","","","","","","","","","","","","","","","","","","","","","","","","","","","","","","","","","","","","","","","","","","","","","","","","",null,0,0,0,null,0,0,0,null,0,0,0,null,0,0,0,null,0,0,0,null,0,0,0,null,0,0,0,null,0,0,0,null,0,0,0,null,0,0,null,0,0,0]
[null,null,null,null,null,null,null,null,null,null,null,null,null,null,null,null,null,null,null,null,null,null,null,null,15,"","","","","","","","","","","","","","",1,2,3,4,5,6,7,8,9,10,11,12,13,14,15,"","","","","","","","","","","","","","","","","","","","","","","","","","","","","","","","","","","","","","","","","","","","","","","","","","","","","","","","","","","","","","","","","","","","","","","","","","","","","","","","","","","","","","","","","","","","","","","","","","","","","","","","","","","","","","","","","","","","","","","","","","","","","","","","","","","","","","","","","","","","","","","","","","","","","","","","","","","","","","","","","","","","","","","","","","","","","","","","","","",null,0,0,0,null,0,0,0,null,0,0,0,null,0,0,0,null,0,0,0,null,0,0,0,null,0,0,0,null,0,0,0,null,0,0,0,null,0,0,null,0,0,0]
[null,null,null,null,null,null,null,null,null,null,null,null,null,null,null,null,null,null,null,null,null,null,null,null,16,"","","","","","","","","","","","","","","",1,2,3,4,5,6,7,8,9,10,11,12,13,14,15,"","","","","","","","","","","","","","","","","","","","","","","","","","","","","","","","","","","","","","","","","","","","","","","","","","","","","","","","","","","","","","","","","","","","","","","","","","","","","","","","","","","","","","","","","","","","","","","","","","","","","","","","","","","","","","","","","","","","","","","","","","","","","","","","","","","","","","","","","","","","","","","","","","","","","","","","","","","","","","","","","","","","","","","","","","","","","","","","","",null,0,0,0,null,0,0,0,null,0,0,0,null,0,0,0,null,0,0,0,null,0,0,0,null,0,0,0,null,0,0,0,null,0,0,0,null,0,0,null,0,0,0]
[null,null,null,null,null,null,null,null,null,null,null,null,null,null,null,null,null,null,null,null,null,null,null,null,17,"","","","","","","","","","","","","","","","",1,2,3,4,5,6,7,8,9,10,11,12,13,14,15,"","","","","","","","","","","","","","","","","","","","","","","","","","","","","","","","","","","","","","","","","","","","","","","","","","","","","","","","","","","","","","","","","","","","","","","","","","","","","","","","","","","","","","","","","","","","","","","","","","","","","","","","","","","","","","","","","","","","","","","","","","","","","","","","","","","","","","","","","","","","","","","","","","","","","","","","","","","","","","","","","","","","","","","","","","","","","","","","",null,0,0,0,null,0,0,0,null,0,0,0,null,0,0,0,null,0,0,0,null,0,0,0,null,0,0,0,null,0,0,0,null,0,0,0,null,0,0,null,0,0,0]
[null,null,null,null,null,null,null,null,null,null,null,null,null,null,null,null,null,null,null,null,null,null,null,null,18,"","","","","","","","","",{"$f":"IFERROR(IF($Y64<=$AD$85,IF(COLUMN()<26+$AD$86,\"\",OFFSET(AI63,0,-$AD$86,1,1)),\"\"),\"\")","v":""},"","","","","","","",1,2,3,4,5,6,7,8,9,10,11,12,13,14,15,"","","","","","","","","","","","","","","","","","","","","","","","","","","","","","","","","","","","","","","","","","","","","","","","","","","","","","","","","","","","","","","","","","","","","","","","","","","","","","","","","","","","","","",{"$f":"IFERROR(IF($Y64<=$AD$85,IF(COLUMN()<26+$AD$86,\"\",OFFSET(EN63,0,-$AD$86,1,1)),\"\"),\"\")","v":""},"","","","","","","","","","","","","","","","","","","","","","","","","","","","","","","","","","","","","","","","","","","","","","","","","","","","","","","","","","","","","","","",{"$f":"IFERROR(IF($Y64<=$AD$85,IF(COLUMN()<26+$AD$86,\"\",OFFSET(GZ63,0,-$AD$86,1,1)),\"\"),\"\")","v":""},"","","","","","","","","","","","","","","","","","","","","","","","",null,0,0,0,null,0,0,0,null,0,0,0,null,0,0,0,null,0,0,0,null,0,0,0,null,0,0,0,null,0,0,0,null,0,0,0,null,0,0,null,0,0,0]
[null,null,null,null,null,null,null,null,null,null,null,null,null,null,null,null,null,null,null,null,null,null,null,null,19,{"$f":"IFERROR(IF($Y65<=$AD$85,IF(COLUMN()<26+$AD$86,\"\",OFFSET(Z64,0,-$AD$86,1,1)),\"\"),\"\")","v":""},"","","","","","","","","","","","","","","","","",1,2,3,4,5,6,7,8,9,10,11,12,13,14,15,"","","","","","","","","","","","","","","","","","","","","","","","","","","","","","","","","","","","","","","","","","","","","","","","","","","","","","","","","","","","","","",{"$f":"IFERROR(IF($Y65<=$AD$85,IF(COLUMN()<26+$AD$86,\"\",OFFSET(DQ64,0,-$AD$86,1,1)),\"\"),\"\")","v":""},"","","","","","","","","","","","","","","","","","","","","","","","","","","","","","","","","","","","","","","","","","","","","","","","","","","","","","","","","","","","","","","",{"$f":"IFERROR(IF($Y65<=$AD$85,IF(COLUMN()<26+$AD$86,\"\",OFFSET(GC64,0,-$AD$86,1,1)),\"\"),\"\")","v":""},"","","","","","","","","","","","","","","","","","","","","","","","","","","","","","","","","","","","","","","","","","","","","","","",null,0,0,0,null,0,0,0,null,0,0,0,null,0,0,0,null,0,0,0,null,0,0,0,null,0,0,0,null,0,0,0,null,0,0,0,null,0,0,null,0,0,0]
[null,null,null,null,null,null,null,null,null,null,null,null,null,null,null,null,null,null,null,null,null,null,null,null,20,"","","","","","","","","","","","","","","","","","","",1,2,3,4,5,6,7,8,9,10,11,12,13,14,15,"","","","","","","","","","","","","","","","","","","","","","","","","","","","","","","","","","","","","","","","","","","","","","","","","","","","","","","","","","","","","","","","","","","","","","","","","","","","","","","","","","","","","","","","","","","","","","","","","","","","","","","","","","","","","","","","","","","","","","","","","","","","","","","","","","","","","","","","","","","","","","","","","","","","","","","","","","","","","","","","","","","","","","","","","","","","","",null,0,0,0,null,0,0,0,null,0,0,0,null,0,0,0,null,0,0,0,null,0,0,0,null,0,0,0,null,0,0,0,null,0,0,0,null,0,0,null,0,0,0]
[null,null,null,null,null,null,null,null,null,null,null,null,null,null,null,null,null,null,null,null,null,null,null,null,21,"","","","","","","","","","","","","","","","","","","","",1,2,3,4,5,6,7,8,9,10,11,12,13,14,15,"","","","","","","","","","","","","","","","","","","","","","","","","","","","",{"$f":"IFERROR(IF($Y67<=$AD$85,IF(COLUMN()<26+$AD$86,\"\",OFFSET(CK66,0,-$AD$86,1,1)),\"\"),\"\")","v":""},"","","","","","","","","","","","","","","","","","","","","","","","","","","","","","","","","","","","","","","","","","","","","","","","","","","","","","","","","","","","","","","","","","","","","","",{"$f":"IFERROR(IF($Y67<=$AD$85,IF(COLUMN()<26+$AD$86,\"\",OFFSET(FD66,0,-$AD$86,1,1)),\"\"),\"\")","v":""},"","","","","","","","","","","","","","","","","","","","","","","","","","","","","","","","","","","","","","","","","","","","","","","","","","","","","","","","","","","","","","","",{"$f":"IFERROR(IF($Y67<=$AD$85,IF(COLUMN()<26+$AD$86,\"\",OFFSET(HP66,0,-$AD$86,1,1)),\"\"),\"\")","v":""},"","","","","","","","",null,0,0,0,null,0,0,0,null,0,0,0,null,0,0,0,null,0,0,0,null,0,0,0,null,0,0,0,null,0,0,0,null,0,0,0,null,0,0,null,0,0,0]
[null,null,null,null,null,null,null,null,null,null,null,null,null,null,null,null,null,null,null,null,null,null,null,null,22,"","","","","","","","","","","","","","","","","","","","","",1,2,3,4,5,6,7,8,9,10,11,12,13,14,15,"","","","","","","","","","","","",{"$f":"IFERROR(IF($Y68<=$AD$85,IF(COLUMN()<26+$AD$86,\"\",OFFSET(BV67,0,-$AD$86,1,1)),\"\"),\"\")","v":""},"","","","","","","","","","","","","","","","","","","","","","","","","","","","","","","","","","","","","","","","","","","","","","","","","","","","","","","","","","","","","","","","","","","","","","","","","","","","","","","","","","","","","","","","","","","","","","","","","","","","","","","","","","","","","","","","","","","","","","","","","","","","","","","","","","","","","","","","","","","","","","","","","","","","","","","","","","","","","","",null,0,0,0,null,0,0,0,null,0,0,0,null,0,0,0,null,0,0,0,null,0,0,0,null,0,0,0,null,{"$f":"IFERROR(IF($Y68<=$AD$85,IF(COLUMN()<26+$AD$86,\"\",OFFSET(JB67,0,-$AD$86,1,1)),\"\"),\"\")","v":0},0,0,null,{"$f":"IFERROR(IF($Y68<=$AD$85,IF(COLUMN()<26+$AD$86,\"\",OFFSET(JF67,0,-$AD$86,1,1)),\"\"),\"\")","v":0},0,0,null,{"$f":"IFERROR(IF($Y68<=$AD$85,IF(COLUMN()<26+$AD$86,\"\",OFFSET(JJ67,0,-$AD$86,1,1)),\"\"),\"\")","v":0},0,null,{"$f":"IFERROR(IF($Y68<=$AD$85,IF(COLUMN()<26+$AD$86,\"\",OFFSET(JM67,0,-$AD$86,1,1)),\"\"),\"\")","v":0},0,0]
[null,null,null,null,null,null,null,null,null,null,null,null,null,null,null,null,null,null,null,null,null,null,null,null,23,"","","","","","","","","","","","","","","","",{"$f":"IFERROR(IF($Y69<=$AD$85,IF(COLUMN()<26+$AD$86,\"\",OFFSET(AP68,0,-$AD$86,1,1)),\"\"),\"\")","v":""},"","","","","",1,2,3,4,5,6,7,8,9,10,11,12,13,14,15,"","","","","","","","","","","","","","","","","","","","","","","","","","","","","","","","","","","","","","","","","","","","","","","","","","","","","","","","","","","","","","","","","","","","","","","","","","","","","","","","","","","","","","","","","","","","","","","","","","","","","","","","","","","","","","","","","","","","","","","","","","","","","","","","","","","","","","","","","","","","","","","","","","","","","","","","","","","","","","","","","","","","","","","","","","",null,0,0,0,null,{"$f":"IFERROR(IF($Y69<=$AD$85,IF(COLUMN()<26+$AD$86,\"\",OFFSET(ID68,0,-$AD$86,1,1)),\"\"),\"\")","v":0},0,0,null,{"$f":"IFERROR(IF($Y69<=$AD$85,IF(COLUMN()<26+$AD$86,\"\",OFFSET(IH68,0,-$AD$86,1,1)),\"\"),\"\")","v":0},0,0,null,{"$f":"IFERROR(IF($Y69<=$AD$85,IF(COLUMN()<26+$AD$86,\"\",OFFSET(IL68,0,-$AD$86,1,1)),\"\"),\"\")","v":0},0,0,null,{"$f":"IFERROR(IF($Y69<=$AD$85,IF(COLUMN()<26+$AD$86,\"\",OFFSET(IP68,0,-$AD$86,1,1)),\"\"),\"\")","v":0},0,0,null,{"$f":"IFERROR(IF($Y69<=$AD$85,IF(COLUMN()<26+$AD$86,\"\",OFFSET(IT68,0,-$AD$86,1,1)),\"\"),\"\")","v":0},0,0,null,{"$f":"IFERROR(IF($Y69<=$AD$85,IF(COLUMN()<26+$AD$86,\"\",OFFSET(IX68,0,-$AD$86,1,1)),\"\"),\"\")","v":0},0,0,null,0,0,0,null,0,0,0,null,0,0,null,0,0,0]
[null,null,null,null,null,null,null,null,null,null,null,null,null,null,null,null,null,null,null,null,null,null,null,null,24,"","","","","","","","","","","","","","","","","","","","","","","",1,2,3,4,5,6,7,8,9,10,11,12,13,14,15,"","","","","","","","","","","","","","","","","","","","","","","","","","","","","","","","","","","","","","","","","","","","","","","","","","","","","","","","","","","","","","","","","","","","","","","","","","","","","","","","","","","","","","","","","","","","","","","","","","","","","","","","","","","","","","","","","","","","","","","","","","","","","","","","","","","","","","","","","","","","","","","","","","","","","","","","","","","","","","","","","","","","","","","","","",null,0,0,0,null,0,0,0,null,0,0,0,null,0,0,0,null,0,0,0,null,0,0,0,null,0,0,0,null,0,0,0,null,0,0,0,null,0,0,null,0,0,0]
[null,null,null,null,null,null,null,null,null,null,null,null,null,null,null,null,null,null,null,null,null,null,null,null,25,"","","","","","","","","","","","","","","","","","","","","","","","",1,2,3,4,5,6,7,8,9,10,11,12,13,14,15,"","","","","","","","","","","","","","","","","","","","","","","","","","","","","","","","","","","","","","","","","","","","","","","","","","","","","","","","","","","","","","","","","","","","","","","","","","","","","","","","","","","","","","","","","","","","","","","","","","","","","","","","","","","","","","","","","","","","","","","","","","","","","","","","","","","","","","","","","","","","","","","","","","","","","","","","","","","","","","","","","","","","","","","","",null,0,0,0,null,0,0,0,null,0,0,0,null,0,0,0,null,0,0,0,null,0,0,0,null,0,0,0,null,0,0,0,null,0,0,0,null,0,0,null,0,0,0]
[null,null,null,null,null,null,null,null,null,null,null,null,null,null,null,null,null,null,null,null,null,null,null,null,26,"","","","","","","","","","","","","","","","","","","","","","","","","",1,2,3,4,5,6,7,8,9,10,11,12,13,14,15,"","","","","","","","","","","","","","","","","","","","","","","","","","","","","","","","","","","","","","","","","","","","","","","","","","","","","","","","","","","","","","","","","","","","","","","","","","","","","","","","","","","","","","","","","","","","","","","","","","","","","","","","","","","","","","","","","","","","","","","","","","","","","","","","","","","","","","","","","","","","","","","","","","","","","","","","","","","","","","","","","","","","","","","",null,0,0,0,null,0,0,0,null,0,0,0,null,0,0,0,null,0,0,0,null,0,0,0,null,0,0,0,null,0,0,0,null,0,0,0,null,0,0,null,0,0,0]
[null,null,null,null,null,null,null,null,null,null,null,null,null,null,null,null,null,null,null,null,null,null,null,null,27,"","","","","","","","","","","","","","","","","","","","","","","","","","",1,2,3,4,5,6,7,8,9,10,11,12,13,14,15,"","","","","","","","","","","","","","","","","","","","","","","","","","","","","","","","","","","","","","","","","","","","","","","","","","","","","","","","","","","","","","","","","","","","","","","","","","","","","","","","","","","","","","","","","","","","","","","","","","","","","","","","","","","","","","","","","","","","","","","","","","","","","","","","","","","","","","","","","","","","","","","","","","","","","","","","","","","","","","","","","","","","","","",null,0,0,0,null,0,0,0,null,0,0,0,null,0,0,0,null,0,0,0,null,0,0,0,null,0,0,0,null,0,0,0,null,0,0,0,null,0,0,null,0,0,0]
[null,null,null,null,null,null,null,null,null,null,null,null,null,null,null,null,null,null,null,null,null,null,null,null,28,"","","","","","","","","","","","","","","","","","","","","","","","","","","",1,2,3,4,5,6,7,8,9,10,11,12,13,14,15,"","","","","","","","","","","","","","","","","","","","","","","","","","","","","","","","","","","","","",{"$f":"IFERROR(IF($Y74<=$AD$85,IF(COLUMN()<26+$AD$86,\"\",OFFSET(DA73,0,-$AD$86,1,1)),\"\"),\"\")","v":""},"","","","","","","","","","","","","","","","","","","","","","","","","","","","","","","","","","","","","","","","","","","","","","","","","","","","","","","","","","","","","","","","","","","","","","",{"$f":"IFERROR(IF($Y74<=$AD$85,IF(COLUMN()<26+$AD$86,\"\",OFFSET(FT73,0,-$AD$86,1,1)),\"\"),\"\")","v":""},"","","","","","","","","","","","","","","","","","","","","","","","","","","","","","","","","","","","","","","","","","","","","","","","","","","","","","","","",null,0,0,0,null,0,0,0,null,0,0,0,null,0,0,0,null,0,0,0,null,0,0,0,null,0,0,0,null,0,0,0,null,0,0,0,null,0,0,null,0,0,0]
[null,null,null,null,null,null,null,null,null,null,null,null,null,null,null,null,null,null,null,null,null,null,null,null,29,"","","","","","",{"$f":"IFERROR(IF($Y75<=$AD$85,IF(COLUMN()<26+$AD$86,\"\",OFFSET(AF74,0,-$AD$86,1,1)),\"\"),\"\")","v":""},"","","","","","","","","","","","","","","","","","","","","",1,2,3,4,5,6,7,8,9,10,11,12,13,14,15,"","","","","","","","","","","","","","","","","","","","","","","","","","","","","","","","","","","","","","","","","","","","","","","","","","","","","","","","","","","","","","","","","","","","","","","","","","","","","","","","","","","","","","","","","","","","","","","","","","","","","","","","","","","","","","","","","","","","","","","","","","","","","","","","","","","","","","","","","","","","","","","","","","","","","","","","","","","","","","","","","","","","",null,0,0,0,null,0,0,0,null,0,0,0,null,0,0,0,null,0,0,0,null,0,0,0,null,0,0,0,null,0,0,0,null,0,0,0,null,0,0,null,0,0,0]
[null,null,null,null,null,null,null,null,null,null,null,null,null,null,null,null,null,null,null,null,null,null,null,null,30,"","","","","","","","","","","","","","","","","","","","","","","","","","","","","",1,2,3,4,5,6,7,8,9,10,11,12,13,14,15,"","","",{"$f":"IFERROR(IF($Y76<=$AD$85,IF(COLUMN()<26+$AD$86,\"\",OFFSET(BU75,0,-$AD$86,1,1)),\"\"),\"\")","v":""},"","","","","","","","","","","","","","","","","","","","","","","","","","","","","","","","","","","","","","","","","","","","","","","","","",{"$f":"IFERROR(IF($Y76<=$AD$85,IF(COLUMN()<26+$AD$86,\"\",OFFSET(DS75,0,-$AD$86,1,1)),\"\"),\"\")","v":""},"","","","","","","","","","","","","","","","","","","","","","","","","","","","","","","","","","","","","","","","","","","","","","","","","","","","","","","","","","","","","","","",{"$f":"IFERROR(IF($Y76<=$AD$85,IF(COLUMN()<26+$AD$86,\"\",OFFSET(GE75,0,-$AD$86,1,1)),\"\"),\"\")","v":""},"","","","","","","","","","","","","","","","","","","","","","","","","","","","","","","","","","","","","","","","","","","","","",null,0,0,0,null,0,0,0,null,0,0,0,null,0,0,0,null,0,0,0,null,0,0,0,null,0,0,0,null,0,0,0,null,0,0,0,null,0,0,null,0,0,0]
[null,null,null,null,null,null,null,null,null,null,null,null,null,null,null,null,null,null,null,null,null,null,null,null,31,"","","","","","","","","","","","","","","","",{"$f":"IFERROR(IF($Y77<=$AD$85,IF(COLUMN()<26+$AD$86,\"\",OFFSET(AP76,0,-$AD$86,1,1)),\"\"),\"\")","v":""},"","","","","","","","","","","","","",1,2,3,4,5,6,7,8,9,10,11,12,13,14,15,"","","","","","","","","","","","","","","","","","","","","","","","","","","","","","","","","","","","","","","","","","","","","","","","","","",{"$f":"IFERROR(IF($Y77<=$AD$85,IF(COLUMN()<26+$AD$86,\"\",OFFSET(DQ76,0,-$AD$86,1,1)),\"\"),\"\")","v":""},"","","","","","","","","","","","","","","","","","","","","","","","","","","","","","","","","","","","","","","","","","","","","","","","","","","","","","","","","","","","","","","","","","","","","","","","","","","","","","","","","","","","","","","","","","","","","","","","","","","","","","","","","","","","","","","",null,0,0,0,null,0,0,0,null,0,0,0,null,0,0,0,null,0,0,0,null,0,0,0,null,0,0,0,null,0,0,0,null,0,0,0,null,0,0,null,0,0,0]
[null,null,null,null,null,null,null,null,null,null,null,null,null,null,null,null,null,null,null,null,null,null,null,null,32,"","","","","","","","","","","","","","","","","","","","","","","","","","","","","","","",1,2,3,4,5,6,7,8,9,10,11,12,13,14,15,"","","","","","","","","","","","","","","","","","","","","","","","","","","","","","","","","","","","","","","","","","","","","","","","","","","","","","","","","","","","","","","","","","","","","","","","","","","","","","","","","","","","","","","","","","","","","","","","","","","","","","","","","","","","","","","","","","","","","","","","","","","","","","","","","","","","","","","","","","","","","","","","","","","","","","","","","","","","","","","","","",null,0,0,0,null,0,0,0,null,0,0,0,null,0,0,0,null,0,0,0,null,0,0,0,null,0,0,0,null,0,0,0,null,0,0,0,null,0,0,null,0,0,0]
[null,null,null,null,null,null,null,null,null,null,null,null,null,null,null,null,null,null,null,null,null,null,null,null,33,"","","","","","","","","","","","","","","","","","","","","","","","","","","","","","","","",1,2,3,4,5,6,7,8,9,10,11,12,13,14,15,"","","","","","","","","","","","","","","","","","","","","","","","","","","","","","","","","","","","","","","","","","","","","","","","","","","","","","","","","","","","","","","","","","","","","","","","","","","","","","","","","","","","","","","","","","","","","","","","","","","","","","","","","","","","","","","","","","","","","","","","","","","","","","","","","","","","","","","","","","","","","","","","","","","","","","","","","","","","","","","","",null,0,0,0,null,0,0,0,null,0,0,0,null,0,0,0,null,0,0,0,null,0,0,0,null,0,0,0,null,0,0,0,null,0,0,0,null,0,0,null,0,0,0]
[null,null,null,null,null,null,null,null,null,null,null,null,null,null,null,null,null,null,null,null,null,null,null,null,34,"","","","","","","","","","","","","","","","","","","","","","","","","","","","","","","","","",1,2,3,4,5,6,7,8,9,10,11,12,13,14,15,"","","","","","","","","","","","","","","","","","","","","","","","","","","","","","","","","","","","","","","","","","","","","","","","","","","","","","","","","","","","","","","","","","","","","","",{"$f":"IFERROR(IF($Y80<=$AD$85,IF(COLUMN()<26+$AD$86,\"\",OFFSET(EN79,0,-$AD$86,1,1)),\"\"),\"\")","v":""},"","","","","","","","","","","","","","","","","","","","","","","","","","","","","","","","","","","","","","","","","","","","","","","","","","","","","","","","","","","","","","","",{"$f":"IFERROR(IF($Y80<=$AD$85,IF(COLUMN()<26+$AD$86,\"\",OFFSET(GZ79,0,-$AD$86,1,1)),\"\"),\"\")","v":""},"","","","","","","","","","","","","","","","","","","","","","","","",null,0,0,0,null,0,0,0,null,0,0,0,null,0,0,0,null,0,0,0,null,0,0,0,null,0,0,0,null,0,0,0,null,0,0,0,null,0,0,null,0,0,0]
[null,null,null,null,null,null,null,null,null,null,null,null,null,null,null,null,null,null,null,null,null,null,null,null,35,{"$f":"IFERROR(IF($Y81<=$AD$85,IF(COLUMN()<26+$AD$86,\"\",OFFSET(Z80,0,-$AD$86,1,1)),\"\"),\"\")","v":""},"","","","","","","","","","","","","","","","","","","","","","","","","","","","","","","","","",1,2,3,4,5,6,7,8,9,10,11,12,13,14,15,"","","","","","","","","","","","","","","","","","","","","","","","","","","","","","","","","","","","","","","","","","","","","","","","","","","","","","","","","","","","","","","","","","","","","","","","","","","","","","","","","","","","","","","","","","","","","","","","","","","","","","","","","","","","","","","","","","","","","","","","","","","","","","","","","","","","","","","","","","","","","","","","","","","","","","","","","","","","","","",null,0,0,0,null,0,0,0,null,0,0,0,null,0,0,0,null,0,0,0,null,0,0,0,null,0,0,0,null,0,0,0,null,0,0,0,null,0,0,null,0,0,0]
[null,null,null,null,null,null,null,null,null,null,null,null,null,null,null,null,null,null,null,null,null,null,null,null,36,"","","","","","","","","","","","","","","","","","","","","","","","","","","","","","","","","","","",1,2,3,4,5,6,7,8,9,10,11,12,13,14,15,"","","","","","","","","","","","","","","","","","","","","","","","","","","","",{"$f":"IFERROR(IF($Y82<=$AD$85,IF(COLUMN()<26+$AD$86,\"\",OFFSET(CZ81,0,-$AD$86,1,1)),\"\"),\"\")","v":""},"","","","","","","","","","","","","","","","","","","","","","","","","","","","","","","","","","","","","","","","","","","","","","","","","","","","","","","","","","","","","","","","","","","","","","","","","","","","","","","","","","","","","","","","","","","","","","","","","","","","","","","","","","","","","","","","","","","","","","","","","","","","","","","","",null,0,0,0,null,0,0,0,null,0,0,0,null,0,0,0,null,0,0,0,null,0,0,0,null,0,0,0,null,0,0,0,null,0,0,0,null,0,0,null,0,0,0]
[null,null,null,null,null,null,null,null,null,null,null,null,null,null,null,null,null,null,null,null,null,null,null,null,37,"","","","","","","","","","","","","","","","","","","","","","","","","","","","","","","","","","","","",1,2,3,4,5,6,7,8,9,10,11,12,13,14,15,"","","","","","","","","","","","","",{"$f":"IFERROR(IF($Y83<=$AD$85,IF(COLUMN()<26+$AD$86,\"\",OFFSET(CL82,0,-$AD$86,1,1)),\"\"),\"\")","v":""},"","","","","","","","","","","","","","","","","","","","","","","","","","","","","","","","","","","","","","","","","","","","","","","","","","","","","","","","","","","","","","","","","","","","","",{"$f":"IFERROR(IF($Y83<=$AD$85,IF(COLUMN()<26+$AD$86,\"\",OFFSET(FD82,0,-$AD$86,1,1)),\"\"),\"\")","v":""},"","","","","","","","","","","","","","","","","","","","","","","","","","","","","","","","","","","","","","","","","","","","","","","","","","","","","","","","","","","","","","","",{"$f":"IFERROR(IF($Y83<=$AD$85,IF(COLUMN()<26+$AD$86,\"\",OFFSET(HP82,0,-$AD$86,1,1)),\"\"),\"\")","v":""},"","","","","","","","",null,0,0,0,null,0,0,0,null,0,0,0,null,0,0,0,null,0,0,0,null,0,0,0,null,0,0,0,null,0,0,0,null,0,0,0,null,0,0,null,0,0,0]
[null,null,null,null,null,null,null,null,null,null,null,null,null,null,null,null,null,null,null,null,null,null,null,null,38,"Wagons",null,null,null,{"$f":"INDEX($I$5:$W$40,MATCH(\"x\",$W$5:$W$40,0),1)","v":15}]
[null,null,null,null,null,null,null,null,null,null,null,null,null,null,null,null,null,null,null,null,null,null,null,null,39,"Zones",null,null,null,{"$f":"INDEX($I$5:$W$40,MATCH(\"x\",$W$5:$W$40,0),2)","v":37}]
[null,null,null,null,null,null,null,null,null,null,null,null,null,null,null,null,null,null,null,null,null,null,null,null,40,"Takt Time",null,null,null,{"$f":"INDEX($I$5:$W$40,MATCH(\"x\",$W$5:$W$40,0),6)","v":1}]

{"sheet":"Buyout & Procurement Log","index":4,"n_rows":186,"n_cols":39,"rows_kept":186,"cut":false,"hidden":false,"merged":[[1,38,3,38]]}
[]
[null,null,null,null,null,null,null,null,null,null,null,null,null,null,null,null,null,null,null,null,null,null,null,null,null,null,null,null,null,null,null,null,null,null,null,null,"Today:",{"$f":"TODAY()","v":"2025-12-08"}]
[null,null,null,null,null,null,null,null,null,null,null,null,null,null,null,null,null,null,null,null,null,null,null,null,null,null,null,null,null,null,null,null,null,null,null,null,"Week of the year:",{"$f":"WEEKNUM(AL2)","v":50}]
[]
[null,"Spec Section ","Takt Zone","Scope of Work ","Selected Subcontractor","RFP To Subcontractor","RFI & PREQ. Prep WKS","RFI & PREQ. Due","RFI Due To Sub Visit Start WKS","Start Trade Partner Site Visit","Trade Visit Start To Bids due WKS","Bids Due ","Bid Review WKS","Client Presentation & Sub Selection ","Approvals & NTP WKS","Start Contracting with Sub","Contracting Process Time (WKS)",null,"Drop Dead Subcontract Execution","Subcontract Executed","Submittal Prep WKS","Receive Submittal ","Actual Approved Submittal ","Submittal Review WKS","Sent To Design Team ","Design Approved","Design Team Approval Wks. ","Release Date (Order Materials By)","Confirmed Release Date","Submittal Over/Under Days","Lead Time WKS","Ship Date","Delivery Weeks","Buffer Duration WEEKS","Actual Date on Site","Required On Job (Get Superintendent Input!)","Material Over/Under DAYS","Notes","Last Date of Contact"]
[null,"Toggle Light Switches",2,"Electrical ","Electrical Services ",{"$f":"IF(H6=\"\",\"\",H6-(7*G6))","v":"2023-07-27"},1,{"$f":"IF(J6=\"\",\"\",J6-(7*I6))","v":"2023-08-03"},1,{"$f":"IF(L6=\"\",\"\",L6-(7*K6))","v":"2023-08-10"},1,{"$f":"IF(N6=\"\",\"\",N6-(7*M6))","v":"2023-08-17"},1,{"$f":"IF(P6=\"\",\"\",P6-(7*O6))","v":"2023-08-24"},1,{"$f":"IF(S6=\"\",\"\",S6-(7*Q6))","v":"2023-08-31"},1,null,{"$f":"IF(V6=\"\",\"\",V6-(7*U6))","v":"2023-09-07"},null,1,{"$f":"IF(Y6=\"\",\"\",Y6-(X6*7))","v":"2023-09-14"},null,1,{"$f":"IF(AB6=\"\",\"\",AB6-(AA6*7))","v":"2023-09-21"},null,1,{"$f":"IF(AF6=\"\",\"\",AF6-(7*AE6))","v":"2023-09-28"},null,{"$f":"IF(AND(W6=\"\", T6=\"\"),\"\",IF(W6=\"\",T6-S6,W6-AB6))","v":""},5,{"$f":"IF(AJ6=\"\",\"\",AJ6-(7*AG6)-(7*AH6))","v":"2023-11-02"},1,1,null,"2023-11-16"]
[null,"Duplex Receptacles",2,"Electrical ","Electrical Services ",{"$f":"IF(H7=\"\",\"\",H7-(7*G7))","v":"2024-10-12"},0,{"$f":"IF(J7=\"\",\"\",J7-(7*I7))","v":"2024-10-12"},0,{"$f":"IF(L7=\"\",\"\",L7-(7*K7))","v":"2024-10-12"},0,{"$f":"IF(N7=\"\",\"\",N7-(7*M7))","v":"2024-10-12"},0,{"$f":"IF(P7=\"\",\"\",P7-(7*O7))","v":"2024-10-12"},0,{"$f":"IF(S7=\"\",\"\",S7-(7*Q7))","v":"2024-10-12"},0,null,{"$f":"IF(V7=\"\",\"\",V7-(7*U7))","v":"2024-10-12"},null,0,{"$f":"IF(Y7=\"\",\"\",Y7-(X7*7))","v":"2024-10-12"},null,0,{"$f":"IF(AB7=\"\",\"\",AB7-(AA7*7))","v":"2024-10-12"},null,0,{"$f":"IF(AF7=\"\",\"\",AF7-(7*AE7))","v":"2024-10-12"},null,{"$f":"IF(AND(W7=\"\", T7=\"\"),\"\",IF(W7=\"\",T7-S7,W7-AB7))","v":""},3,{"$f":"IF(AJ7=\"\",\"\",AJ7-(7*AG7)-(7*AH7))","v":"2024-11-02"},2,0,null,"2024-11-16"]
[null,"Recessed lighting",2,"Electrical ","Electrical Services ","2024-09-14",0,"2024-09-14",0,"2024-09-14",0,"2024-09-14",0,"2024-09-14",0,"2024-09-14",0,null,{"$f":"IF(V8=\"\",\"\",V8-(7*U8))","v":"2024-09-14"},null,0,"2024-09-14",null,0,"2024-09-14",null,0,"2024-09-14",null,"",5,"2024-10-19",2,2,null,"2024-11-16"]
[null,"Cabinets",2,"Casework","Cabintes & More LLC","2024-08-01",0,"2024-08-01",0,"2024-08-01",0,"2024-08-01",0,"2024-08-01",0,"2024-08-01",0,null,{"$f":"IF(V9=\"\",\"\",V9-(7*U9))","v":"2024-08-01"},null,0,"2024-08-01",null,0,"2024-08-01",null,0,"2024-08-01",null,"",14,"2024-11-07",3,0,null,"2024-11-28"]
[null,"Drawers",2,"Casework","Cabintes & More LLC","2024-10-10",0,"2024-10-10",0,"2024-10-10",0,"2024-10-10",0,"2024-10-10",0,"2024-10-10",0,null,{"$f":"IF(V10=\"\",\"\",V10-(7*U10))","v":"2024-10-10"},"2023-12-30",0,"2024-10-10",null,0,"2024-10-10",null,0,"2024-10-10",null,{"$f":"IF(AND(W10=\"\", T10=\"\"),\"\",IF(W10=\"\",T10-S10,W10-AB10))","v":-285},4,"2024-11-07",2,1,null,"2024-11-28"]
[null,"Bookshelves",2,"Casework","Cabintes & More LLC","2024-10-03",0,"2024-10-03",0,"2024-10-03",0,"2024-10-03",0,"2024-10-03",0,"2024-10-03",0,null,"2024-10-03",null,0,"2024-10-03",null,0,"2024-10-03",null,0,"2024-10-03",null,"",7,"2024-11-21",1,0,null,"2024-11-28"]
[null,"Windows",2,"Millwork","Doors & Windows Inc","2024-08-30",0,"2024-08-30",0,"2024-08-30",0,"2024-08-30",0,"2024-08-30",0,{"$f":"IF(S12=\"\",\"\",S12-(7*Q12))","v":"2024-08-30"},0,null,"2024-08-30",null,0,"2024-08-30",null,0,"2024-08-30",null,0,"2024-08-30",null,"",8,"2024-10-25",5,1,null,"2024-12-06"]
[null,"Doors",2,"Millwork","Doors & Windows Inc","2024-10-11",0,"2024-10-11",0,"2024-10-11",0,"2024-10-11",0,"2024-10-11",0,"2024-10-11",0,null,"2024-10-11",null,0,"2024-10-11",null,0,"2024-10-11",null,0,"2024-10-11",null,"",4,"2024-11-08",3,1,null,"2024-12-06"]
[null,"Light Fixtures",2,"Electrical ","Electrical Services ","2024-06-22",0,"2024-06-22",0,"2024-06-22",0,"2024-06-22",0,"2024-06-22",0,"2024-06-22",0,null,"2024-06-22",null,0,"2024-06-22",null,0,"2024-06-22",null,0,"2024-06-22",null,"",20,"2024-11-09",1,0,null,"2024-11-16"]
[null,"Electric Sockets",2,"Electrical ","Electrical Services ","2024-10-05",0,"2024-10-05",0,"2024-10-05",0,"2024-10-05",0,"2024-10-05",0,"2024-10-05",0,null,"2024-10-05",null,0,"2024-10-05",null,0,"2024-10-05",null,0,"2024-10-05",null,"",3,"2024-10-26",2,1,null,"2024-11-16"]
[null,"Security Alarm System",2,"Electrical ","Electrical Services ","2024-10-19",0,"2024-10-19",0,{"$f":"IF(L16=\"\",\"\",L16-(7*K16))","v":"2024-10-19"},0,"2024-10-19",0,"2024-10-19",0,"2024-10-19",0,null,"2024-10-19",null,0,"2024-10-19",null,0,"2024-10-19",null,0,"2024-10-19",null,"",2,"2024-11-02",2,0,null,"2024-11-16"]
[null,"Fire Alarm",2,"Electrical ","Electrical Services ","2024-10-05",0,"2024-10-05",0,"2024-10-05",0,"2024-10-05",0,"2024-10-05",0,"2024-10-05",0,null,"2024-10-05",null,0,"2024-10-05",null,0,"2024-10-05",null,0,"2024-10-05",null,"",2,"2024-10-19",2,2,null,"2024-11-16"]
[null,"Kitchens",2,"Casework","Kitchens Inc","2024-08-31",0,"2024-08-31",0,"2024-08-31",0,"2024-08-31",0,"2024-08-31",0,"2024-08-31",0,null,"2024-08-31","2023-12-30",0,"2024-08-31",null,0,"2024-08-31",null,0,"2024-08-31",null,-245,10,"2024-11-09",2,1,null,"2024-11-30"]
[null,null,null,null,null,"2025-02-21",0,"2025-02-21",0,"2025-02-21",0,"2025-02-21",0,"2025-02-21",0,"2025-02-21",0,null,"2025-02-21",null,29,"2025-09-12",null,2,"2025-09-26",null,10,"2025-12-05",null,"",0,{"$f":"IF(AJ19=\"\",\"\",AJ19-(7*AG19)-(7*AH19))","v":"2025-12-05"},1,0,null,"2025-12-12"]
[null,null,null,null,null,"",0,"",0,"",0,"",0,"",0,"",0,null,"",null,0,"",null,0,"",null,0,"",null,"",0,"",0,0]
[null,null,null,null,null,"",0,"",0,"",0,"",0,"",0,"",0,null,"",null,0,"",null,0,"",null,0,"",null,"",0,"",0,0]
[null,null,null,null,null,"",0,"",0,"",0,"",0,"",0,"",0,null,"",null,0,"",null,0,"",null,0,"",null,"",0,"",0,0]
[null,null,null,null,null,"",0,"",0,"",0,"",0,"",0,"",0,null,"",null,0,"",null,0,"",null,0,"",null,"",0,"",0,0]
[null,null,null,null,null,"",2,"",2,"",2,"",2,"",2,"",2,null,"",null,2,"",null,2,"",null,2,"",null,"",0,"",0,0]
[null,null,null,null,null,"",0,"",0,"",0,"",0,"",0,"",0,null,"",null,0,"",null,0,"",null,0,"",null,"",0,"",0,0]
[null,null,null,null,null,"",0,"",0,"",0,"",0,"",0,"",0,null,"",null,0,"",null,0,"",null,0,"",null,"",0,"",0,0]
[null,null,null,null,null,"",0,"",0,"",0,"",0,"",0,"",0,null,"",null,0,"",null,0,"",null,0,"",null,"",0,"",0,0]
[null,null,null,null,null,"",0,"",0,"",0,"",0,"",0,"",0,null,"",null,0,"",null,0,"",null,0,"",null,"",0,"",0,0]
[null,null,null,null,null,"",0,"",0,"",0,"",0,"",0,"",0,null,"",null,0,"",null,0,"",null,0,"",null,"",0,"",0,0]
[null,null,null,null,null,"",0,"",0,"",0,"",0,"",0,"",0,null,"",null,0,"",null,0,"",null,0,"",null,"",0,"",0,0]
[null,null,null,null,null,"",0,"",0,"",0,"",0,"",0,"",0,null,"",null,0,"",null,0,"",null,0,"",null,"",0,"",0,0]
[null,null,null,null,null,"",0,"",0,"",0,"",0,"",0,"",0,null,"",null,0,"",null,0,"",null,0,"",null,"",0,"",0,0]
[null,null,null,null,null,"",0,"",0,"",0,"",0,"",0,"",0,null,"",null,0,"",null,0,"",null,0,"",null,"",0,"",0,0]
[null,null,null,null,null,"",0,"",0,"",0,"",0,"",0,"",0,null,"",null,0,"",null,0,"",null,0,"",null,"",0,"",0,0]
[null,null,null,null,null,"",0,"",0,"",0,"",0,"",0,"",0,null,"",null,0,"",null,0,"",null,0,"",null,"",0,"",0,0]
[null,null,null,null,null,"",0,"",0,"",0,"",0,"",0,"",0,null,"",null,0,"",null,0,"",null,0,"",null,"",0,"",0,0]
[null,null,null,null,null,"",0,"",0,"",0,"",0,"",0,"",0,null,"",null,0,"",null,0,"",null,0,"",null,"",0,"",0,0]
[null,null,null,null,null,"",0,"",0,"",0,"",0,"",0,"",0,null,"",null,0,"",null,0,"",null,0,"",null,"",0,"",0,0]
[null,null,null,null,null,"",0,"",0,"",0,"",0,"",0,"",0,null,{"$f":"IF(V39=\"\",\"\",V39-(7*U39))","v":""},null,0,"",null,0,"",null,0,{"$f":"IF(AF39=\"\",\"\",AF39-(7*AE39))","v":""},null,"",0,"",0,0]
[null,null,null,null,null,"",0,"",0,"",0,"",0,"",0,"",0,null,{"$f":"IF(V40=\"\",\"\",V40-(7*U40))","v":""},null,0,"",null,0,"",null,0,"",null,"",0,"",0,0]
[null,null,null,null,null,"",0,"",0,"",0,"",0,"",0,"",0,null,"",null,0,"",null,0,"",null,0,"",null,"",0,"",0,0]
[null,null,null,null,null,"",0,"",0,"",0,"",0,"",0,"",0,null,"",null,0,"",null,0,"",null,0,"",null,"",0,"",0,0]
[null,null,null,null,null,"",0,"",0,"",0,"",0,"",0,"",0,null,"",null,0,"",null,0,"",null,0,"",null,"",0,"",0,0]
[null,null,null,null,null,"",0,"",0,"",0,"",0,"",0,"",0,null,"",null,0,"",null,0,"",null,0,"",null,"",0,"",0,0]
[null,null,null,null,null,"",0,"",0,"",0,"",0,"",0,"",0,null,"",null,0,"",null,0,"",null,0,"",null,"",0,"",0,0]
[null,null,null,null,null,"",0,"",0,"",0,"",0,"",0,"",0,null,"",null,0,"",null,0,"",null,0,"",null,"",0,"",0,0]
[null,null,null,null,null,"",0,"",0,"",0,"",0,"",0,"",0,null,"",null,0,{"$f":"IF(Y47=\"\",\"\",Y47-(X47*7))","v":""},null,0,"",null,0,"",null,"",0,"",0,0]
[null,null,null,null,null,"",0,"",0,"",0,"",0,"",0,"",0,null,"",null,0,"",null,0,"",null,0,"",null,"",0,"",0,0]
[null,null,null,null,null,"",0,"",0,"",0,"",0,"",0,"",0,null,"",null,0,"",null,0,"",null,0,"",null,"",0,"",0,0]
[null,null,null,null,null,"",0,"",0,"",0,"",0,"",0,"",0,null,"",null,0,"",null,0,"",null,0,"",null,"",0,"",0,0]
[null,null,null,null,null,"",0,"",0,"",0,"",0,"",0,"",0,null,"",null,0,"",null,0,"",null,0,"",null,"",0,"",0,0]
[null,null,null,null,null,"",0,"",0,"",0,"",0,"",0,"",0,null,"",null,0,"",null,0,"",null,0,"",null,"",0,"",0,0]
[null,null,null,null,null,"",0,"",0,"",0,"",0,"",0,"",0,null,"",null,0,"",null,0,"",null,0,"",null,"",0,"",0,0]
[null,null,null,null,null,"",0,"",0,"",0,"",0,"",0,"",0,null,"",null,0,"",null,0,"",null,0,"",null,"",0,"",0,0]
[null,null,null,null,null,"",0,"",0,"",0,"",0,"",0,"",0,null,"",null,0,"",null,0,"",null,0,"",null,"",0,"",0,0]
[null,null,null,null,null,"",0,"",0,"",0,"",0,"",0,"",0,null,"",null,0,"",null,0,"",null,0,"",null,"",0,"",0,0]
[null,null,null,null,null,"",0,"",0,"",0,"",0,"",0,"",0,null,"",null,0,"",null,0,"",null,0,"",null,"",0,"",0,0]
[null,null,null,null,null,"",0,"",0,"",0,"",0,"",0,"",0,null,"",null,0,"",null,0,"",null,0,"",null,"",0,"",0,0]
[null,null,null,null,null,"",0,"",0,"",0,"",0,"",0,"",0,null,"",null,0,"",null,0,"",null,0,"",null,"",0,"",0,0]
[null,null,null,null,null,"",0,"",0,"",0,"",0,"",0,"",0,null,"",null,0,"",null,0,"",null,0,"",null,"",0,"",0,0]
[null,null,null,null,null,"",0,"",0,"",0,"",0,"",0,"",0,null,"",null,0,"",null,0,"",null,0,"",null,"",0,"",0,0]
[null,null,null,null,null,"",0,"",0,"",0,"",0,"",0,"",0,null,"",null,0,"",null,0,"",null,0,"",null,"",0,"",0,0]
[null,null,null,null,null,"",0,"",0,"",0,"",0,"",0,"",0,null,"",null,0,"",null,0,"",null,0,"",null,"",0,"",0,0]
[null,null,null,null,null,"",0,"",0,"",0,"",0,"",0,"",0,null,"",null,0,"",null,0,"",null,0,"",null,"",0,"",0,0]
[null,null,null,null,null,"",0,"",0,"",0,"",0,"",0,"",0,null,"",null,0,"",null,0,"",null,0,"",null,"",0,"",0,0]
[null,null,null,null,null,"",0,"",0,"",0,"",0,"",0,"",0,null,"",null,0,"",null,0,"",null,0,"",null,"",0,"",0,0]
[null,null,null,null,null,"",0,"",0,"",0,"",0,"",0,"",0,null,"",null,0,"",null,0,"",null,0,"",null,"",0,"",0,0]
[null,null,null,null,null,"",0,"",0,"",0,"",0,"",0,"",0,null,"",null,0,"",null,0,"",null,0,"",null,"",0,"",0,0]
[null,null,null,null,null,"",0,"",0,"",0,"",0,"",0,"",0,null,"",null,0,"",null,0,"",null,0,"",null,"",0,"",0,0]
[null,null,null,null,null,"",0,"",0,"",0,"",0,"",0,"",0,null,"",null,0,"",null,0,"",null,0,"",null,"",0,"",0,0]
[null,null,null,null,null,{"$f":"IF(H71=\"\",\"\",H71-(7*G71))","v":""},0,{"$f":"IF(J71=\"\",\"\",J71-(7*I71))","v":""},0,{"$f":"IF(L71=\"\",\"\",L71-(7*K71))","v":""},0,{"$f":"IF(N71=\"\",\"\",N71-(7*M71))","v":""},0,{"$f":"IF(P71=\"\",\"\",P71-(7*O71))","v":""},0,{"$f":"IF(S71=\"\",\"\",S71-(7*Q71))","v":""},0,null,"",null,0,{"$f":"IF(Y71=\"\",\"\",Y71-(X71*7))","v":""},null,0,{"$f":"IF(AB71=\"\",\"\",AB71-(AA71*7))","v":""},null,0,"",null,{"$f":"IF(AND(W71=\"\", T71=\"\"),\"\",IF(W71=\"\",T71-S71,W71-AB71))","v":""},0,{"$f":"IF(AJ71=\"\",\"\",AJ71-(7*AG71)-(7*AH71))","v":""},0,0]
[null,null,null,null,null,"",0,"",0,"",0,"",0,"",0,"",0,null,"",null,0,"",null,0,"",null,0,"",null,"",0,"",0,0]
[null,null,null,null,null,"",0,"",0,"",0,"",0,"",0,"",0,null,"",null,0,"",null,0,"",null,0,{"$f":"IF(AF73=\"\",\"\",AF73-(7*AE73))","v":""},null,"",0,"",0,0]
[null,null,null,null,null,"",0,"",0,"",0,"",0,"",0,"",0,null,{"$f":"IF(V74=\"\",\"\",V74-(7*U74))","v":""},null,0,"",null,0,"",null,0,"",null,"",0,"",0,0]
[null,null,null,null,null,"",0,"",0,"",0,"",0,"",0,"",0,null,"",null,0,{"$f":"IF(Y75=\"\",\"\",Y75-(X75*7))","v":""},null,0,"",null,0,"",null,"",0,"",0,0]
[null,null,null,null,null,"",0,"",0,"",0,"",0,"",0,"",0,null,"",null,0,{"$f":"IF(Y76=\"\",\"\",Y76-(X76*7))","v":""},null,0,"",null,0,"",null,"",0,"",0,0]
[null,null,null,null,null,"",0,"",0,"",0,"",0,"",0,"",0,null,null,null,0,"",null,0,"",null,0,null,null,"",0,null,0,0]
[null,null,null,null,null,"",0,"",0,"",0,"",0,"",0,"",0,null,null,null,0,"",null,0,"",null,0,null,null,"",0,null,0,0]
[null,null,null,null,null,"",0,"",0,"",0,"",0,"",0,"",0,null,"",null,0,"",null,0,"",null,0,"",null,"",0,{"$f":"IF(AJ79=\"\",\"\",AJ79-(7*AG79)-(7*AH79))","v":""},0,0]
[null,null,null,null,null,"",0,"",0,"",0,"",0,"",0,"",0,null,"",null,0,"",null,0,"",null,0,"",null,"",0,"",0,0]
[null,null,null,null,null,"",0,"",0,"",0,"",0,"",0,"",0,null,"",null,0,"",null,0,"",null,0,"",null,"",0,"",0,0]
[null,null,null,null,null,"",0,"",0,"",0,"",0,"",0,"",0,null,"",null,0,"",null,0,"",null,0,"",null,"",0,"",0,0]
[null,null,null,null,null,"",0,"",0,"",0,"",0,"",0,"",0,null,"",null,0,"",null,0,"",null,0,"",null,"",0,"",0,0]
[null,null,null,null,null,"",0,"",0,"",0,"",0,"",0,"",0,null,"",null,0,"",null,0,"",null,0,"",null,"",0,"",0,0]
[null,null,null,null,null,"",0,"",0,"",0,"",0,"",0,"",0,null,"",null,0,"",null,0,"",null,0,"",null,"",0,"",0,0]
[null,null,null,null,null,"",0,"",0,"",0,"",0,"",0,"",0,null,"",null,0,"",null,0,"",null,0,"",null,"",0,"",0,0]
[null,null,null,null,null,"",0,"",0,"",0,"",0,"",0,"",0,null,"",null,0,"",null,0,"",null,0,"",null,"",0,"",0,0]
[null,null,null,null,null,"",0,"",0,"",0,"",0,"",0,"",0,null,"",null,0,"",null,0,"",null,0,"",null,"",0,"",0,0]
[null,null,null,null,null,"",0,"",0,"",0,"",0,"",0,"",0,null,"",null,0,"",null,0,"",null,0,"",null,"",0,"",0,0]
[null,null,null,null,null,"",0,"",0,"",0,"",0,"",0,"",0,null,"",null,0,"",null,0,"",null,0,"",null,"",0,"",0,0]
[null,null,null,null,null,"",0,"",0,"",0,"",0,"",0,"",0,null,"",null,0,"",null,0,"",null,0,"",null,"",0,"",0,0]
[null,null,null,null,null,"",0,"",0,"",0,"",0,"",0,"",0,null,"",null,0,"",null,0,"",null,0,"",null,"",0,"",0,0]
[null,null,null,null,null,"",0,"",0,"",0,"",0,"",0,"",0,null,"",null,0,"",null,0,"",null,0,"",null,"",0,"",0,0]
[null,null,null,null,null,"",0,"",0,"",0,"",0,"",0,"",0,null,"",null,0,"",null,0,"",null,0,"",null,"",0,"",0,0]
[null,null,null,null,null,"",0,"",0,"",0,"",0,"",0,"",0,null,"",null,0,"",null,0,"",null,0,"",null,"",0,"",0,0]
[null,null,null,null,null,"",0,"",0,"",0,"",0,"",0,"",0,null,"",null,0,"",null,0,"",null,0,"",null,"",0,"",0,0]
[null,null,null,null,null,"",0,"",0,"",0,"",0,"",0,"",0,null,"",null,0,"",null,0,"",null,0,"",null,"",0,"",0,0]
[null,null,null,null,null,"",0,"",0,"",0,"",0,"",0,"",0,null,"",null,0,"",null,0,"",null,0,"",null,"",0,"",0,0]
[null,null,null,null,null,"",0,"",0,"",0,"",0,"",0,"",0,null,"",null,0,"",null,0,"",null,0,"",null,"",0,"",0,0]
[null,null,null,null,null,"",0,"",0,"",0,"",0,"",0,"",0,null,"",null,0,"",null,0,"",null,0,"",null,"",0,"",0,0]
[null,null,null,null,null,"",0,"",0,"",0,"",0,"",0,"",0,null,"",null,0,"",null,0,"",null,0,"",null,"",0,"",0,0]
[null,null,null,null,null,"",0,"",0,"",0,"",0,"",0,"",0,null,"",null,0,"",null,0,"",null,0,"",null,"",0,"",0,0]
[null,null,null,null,null,"",0,"",0,"",0,"",0,"",0,"",0,null,"",null,0,"",null,0,"",null,0,"",null,"",0,"",0,0]
[null,null,null,null,null,"",0,"",0,"",0,"",0,"",0,"",0,null,"",null,0,"",null,0,"",null,0,"",null,"",0,"",0,0]
[null,null,null,null,null,"",0,"",0,"",0,"",0,"",0,"",0,null,"",null,0,"",null,0,"",null,0,"",null,"",0,"",0,0]
[null,null,null,null,null,"",0,"",0,"",0,"",0,"",0,"",0,null,"",null,0,"",null,0,"",null,0,"",null,"",0,"",0,0]
[null,null,null,null,null,"",0,"",0,"",0,"",0,"",0,"",0,null,"",null,0,"",null,0,"",null,0,"",null,"",0,"",0,0]
[null,null,null,null,null,"",0,"",0,"",0,"",0,"",0,"",0,null,"",null,0,"",null,0,"",null,0,"",null,"",0,"",0,0]
[null,null,null,null,null,"",0,"",0,"",0,"",0,"",0,"",0,null,"",null,0,"",null,0,"",null,0,"",null,"",0,"",0,0]
[null,null,null,null,null,"",0,"",0,"",0,"",0,"",0,"",0,null,"",null,0,{"$f":"IF(Y110=\"\",\"\",Y110-(X110*7))","v":""},null,0,"",null,0,"",null,"",0,"",0,0]
[null,null,null,null,null,"",0,"",0,"",0,"",0,"",0,"",0,null,"",null,0,{"$f":"IF(Y111=\"\",\"\",Y111-(X111*7))","v":""},null,0,"",null,0,"",null,"",0,"",0,0]
[null,null,null,null,null,"",0,"",0,"",0,"",0,"",0,"",0,null,"",null,0,"",null,0,"",null,0,"",null,"",0,"",0,0]
[null,null,null,null,null,"",0,"",0,"",0,"",0,"",0,"",0,null,"",null,0,"",null,0,"",null,0,"",null,"",0,"",0,0]
[null,null,null,null,null,"",0,"",0,"",0,"",0,"",0,"",0,null,"",null,0,"",null,0,"",null,0,"",null,"",0,"",0,0]
[null,null,null,null,null,"",0,"",0,"",0,"",0,"",0,"",0,null,"",null,0,"",null,0,"",null,0,"",null,"",0,"",0,0]
[null,null,null,null,null,"",0,"",0,"",0,"",0,"",0,"",0,null,"",null,0,"",null,0,"",null,0,"",null,"",0,"",0,0]
[null,null,null,null,null,"",0,"",0,"",0,"",0,"",0,"",0,null,"",null,0,"",null,0,"",null,0,"",null,"",0,"",0,0]
[null,null,null,null,null,"",0,"",0,"",0,"",0,"",0,"",0,null,"",null,0,"",null,0,"",null,0,"",null,"",0,"",0,0]
[null,null,null,null,null,"",0,"",0,"",0,"",0,"",0,"",0,null,"",null,0,"",null,0,"",null,0,"",null,"",0,"",0,0]
[null,null,null,null,null,"",0,"",0,"",0,"",0,"",0,"",0,null,"",null,0,"",null,0,"",null,0,"",null,"",0,"",0,0]
[null,null,null,null,null,"",0,"",0,"",0,"",0,"",0,"",0,null,"",null,0,"",null,0,"",null,0,"",null,"",0,"",0,0]
[null,null,null,null,null,"",0,"",0,"",0,"",0,"",0,"",0,null,"",null,0,"",null,0,"",null,0,"",null,"",0,"",0,0]
[null,null,null,null,null,"",0,"",0,"",0,"",0,"",0,"",0,null,"",null,0,"",null,0,"",null,0,"",null,"",0,"",0,0]
[null,null,null,null,null,"",0,"",0,"",0,"",0,"",0,"",0,null,"",null,0,"",null,0,"",null,0,"",null,"",0,"",0,0]
[null,null,null,null,null,"",0,"",0,"",0,"",0,"",0,"",0,null,"",null,0,"",null,0,"",null,0,"",null,"",0,"",0,0]
[null,null,null,null,null,"",0,"",0,"",0,"",0,"",0,"",0,null,"",null,0,"",null,0,"",null,0,"",null,"",0,"",0,0]
[null,null,null,null,null,"",0,"",0,"",0,"",0,"",0,"",0,null,"",null,0,"",null,0,"",null,0,"",null,"",0,"",0,0]
[null,null,null,null,null,"",0,"",0,"",0,"",0,"",0,"",0,null,"",null,0,"",null,0,"",null,0,"",null,"",0,"",0,0]
[null,null,null,null,null,"",0,"",0,"",0,"",0,"",0,"",0,null,"",null,0,"",null,0,"",null,0,"",null,"",0,"",0,0]
[null,null,null,null,null,"",0,"",0,"",0,"",0,"",0,"",0,null,"",null,0,"",null,0,"",null,0,"",null,"",0,"",0,0]
[null,null,null,null,null,"",0,"",0,"",0,"",0,"",0,"",0,null,"",null,0,"",null,0,"",null,0,"",null,"",0,"",0,0]
[null,null,null,null,null,"",0,"",0,"",0,"",0,"",0,"",0,null,"",null,0,"",null,0,"",null,0,"",null,"",0,"",0,0]
[null,null,null,null,null,"",0,"",0,"",0,"",0,"",0,"",0,null,"",null,0,"",null,0,"",null,0,"",null,"",0,"",0,0]
[null,null,null,null,null,"",0,"",0,"",0,"",0,"",0,"",0,null,"",null,0,"",null,0,"",null,0,"",null,"",0,"",0,0]
[null,null,null,null,null,{"$f":"IF(H135=\"\",\"\",H135-(7*G135))","v":""},0,{"$f":"IF(J135=\"\",\"\",J135-(7*I135))","v":""},0,{"$f":"IF(L135=\"\",\"\",L135-(7*K135))","v":""},0,{"$f":"IF(N135=\"\",\"\",N135-(7*M135))","v":""},0,{"$f":"IF(P135=\"\",\"\",P135-(7*O135))","v":""},0,{"$f":"IF(S135=\"\",\"\",S135-(7*Q135))","v":""},0,null,"",null,0,"",null,0,{"$f":"IF(AB135=\"\",\"\",AB135-(AA135*7))","v":""},null,0,"",null,{"$f":"IF(AND(W135=\"\", T135=\"\"),\"\",IF(W135=\"\",T135-S135,W135-AB135))","v":""},0,"",0,0]
[null,null,null,null,null,"",0,"",0,"",0,"",0,"",0,"",0,null,"",null,0,"",null,0,"",null,0,"",null,"",0,"",0,0]
[null,null,null,null,null,"",0,"",0,"",0,"",0,"",0,"",0,null,"",null,0,"",null,0,"",null,0,{"$f":"IF(AF137=\"\",\"\",AF137-(7*AE137))","v":""},null,"",0,"",0,0]
[null,null,null,null,null,"",0,"",0,"",0,"",0,"",0,"",0,null,{"$f":"IF(V138=\"\",\"\",V138-(7*U138))","v":""},null,0,"",null,0,"",null,0,"",null,"",0,"",0,0]
[null,null,null,null,null,"",0,"",0,"",0,"",0,"",0,"",0,null,"",null,0,"",null,0,"",null,0,"",null,"",0,"",0,0]
[null,null,null,null,null,"",0,"",0,"",0,"",0,"",0,"",0,null,"",null,0,"",null,0,"",null,0,"",null,"",0,"",0,0]
[null,null,null,null,null,"",0,"",0,"",0,"",0,"",0,"",0,null,"",null,0,{"$f":"IF(Y141=\"\",\"\",Y141-(X141*7))","v":""},null,0,"",null,0,"",null,"",0,"",0,0]
[null,null,null,null,null,"",0,"",0,"",0,"",0,"",0,"",0,null,"",null,0,{"$f":"IF(Y142=\"\",\"\",Y142-(X142*7))","v":""},null,0,"",null,0,"",null,"",0,"",0,0]
[null,null,null,null,null,"",0,"",0,"",0,"",0,"",0,"",0,null,"",null,0,"",null,0,"",null,0,"",null,"",0,{"$f":"IF(AJ143=\"\",\"\",AJ143-(7*AG143)-(7*AH143))","v":""},0,0]
[null,null,null,null,null,"",0,"",0,"",0,"",0,"",0,"",0,null,"",null,0,"",null,0,"",null,0,"",null,"",0,"",0,0]
[null,null,null,null,null,"",0,"",0,"",0,"",0,"",0,"",0,null,"",null,0,"",null,0,"",null,0,"",null,"",0,"",0,0]
[null,null,null,null,null,"",0,"",0,"",0,"",0,"",0,"",0,null,"",null,0,"",null,0,"",null,0,"",null,"",0,"",0,0]
[null,null,null,null,null,"",0,"",0,"",0,"",0,"",0,"",0,null,"",null,0,"",null,0,"",null,0,"",null,"",0,"",0,0]
[null,null,null,null,null,"",0,"",0,"",0,"",0,"",0,"",0,null,"",null,0,"",null,0,"",null,0,"",null,"",0,"",0,0]
[null,null,null,null,null,"",0,"",0,"",0,"",0,"",0,"",0,null,"",null,0,"",null,0,"",null,0,"",null,"",0,"",0,0]
[null,null,null,null,null,"",0,"",0,"",0,"",0,"",0,"",0,null,"",null,0,"",null,0,"",null,0,"",null,"",0,"",0,0]
[null,null,null,null,null,"",0,"",0,"",0,"",0,"",0,"",0,null,"",null,0,"",null,0,"",null,0,"",null,"",0,"",0,0]
[null,null,null,null,null,"",0,"",0,"",0,"",0,"",0,"",0,null,"",null,0,"",null,0,"",null,0,"",null,"",0,"",0,0]
[null,null,null,null,null,"",0,"",0,"",0,"",0,"",0,"",0,null,"",null,0,"",null,0,"",null,0,"",null,"",0,"",0,0]
[null,null,null,null,null,"",0,"",0,"",0,"",0,"",0,"",0,null,"",null,0,"",null,0,"",null,0,"",null,"",0,"",0,0]
[null,null,null,null,null,"",0,"",0,"",0,"",0,"",0,"",0,null,"",null,0,"",null,0,"",null,0,"",null,"",0,"",0,0]
[null,null,null,null,null,"",0,"",0,"",0,"",0,"",0,"",0,null,"",null,0,"",null,0,"",null,0,"",null,"",0,"",0,0]
[null,null,null,null,null,"",0,"",0,"",0,"",0,"",0,"",0,null,"",null,0,"",null,0,"",null,0,"",null,"",0,"",0,0]
[null,null,null,null,null,"",0,"",0,"",0,"",0,"",0,"",0,null,"",null,0,"",null,0,"",null,0,"",null,"",0,"",0,0]
[null,null,null,null,null,"",0,"",0,"",0,"",0,"",0,"",0,null,"",null,0,"",null,0,"",null,0,"",null,"",0,"",0,0]
[null,null,null,null,null,"",0,"",0,"",0,"",0,"",0,"",0,null,"",null,0,"",null,0,"",null,0,"",null,"",0,"",0,0]
[null,null,null,null,null,"",0,"",0,"",0,"",0,"",0,"",0,null,"",null,0,"",null,0,"",null,0,"",null,"",0,"",0,0]
[null,null,null,null,null,"",0,"",0,"",0,"",0,"",0,"",0,null,"",null,0,"",null,0,"",null,0,"",null,"",0,"",0,0]
[null,null,null,null,null,"",0,"",0,"",0,"",0,"",0,"",0,null,"",null,0,"",null,0,"",null,0,"",null,"",0,"",0,0]
[null,null,null,null,null,"",0,"",0,"",0,"",0,"",0,"",0,null,"",null,0,"",null,0,"",null,0,"",null,"",0,"",0,0]
[null,null,null,null,null,"",0,"",0,"",0,"",0,"",0,"",0,null,"",null,0,"",null,0,"",null,0,"",null,"",0,"",0,0]
[null,null,null,null,null,"",0,"",0,"",0,"",0,"",0,"",0,null,"",null,0,"",null,0,"",null,0,"",null,"",0,"",0,0]
[null,null,null,null,null,"",0,"",0,"",0,"",0,"",0,"",0,null,"",null,0,"",null,0,"",null,0,"",null,"",0,"",0,0]
[null,null,null,null,null,"",0,"",0,"",0,"",0,"",0,"",0,null,"",null,0,"",null,0,"",null,0,"",null,"",0,"",0,0]
[null,null,null,null,null,"",0,"",0,"",0,"",0,"",0,"",0,null,"",null,0,"",null,0,"",null,0,"",null,"",0,"",0,0]
[null,null,null,null,null,"",0,"",0,"",0,"",0,"",0,"",0,null,"",null,0,"",null,0,"",null,0,"",null,"",0,"",0,0]
[null,null,null,null,null,"",0,"",0,"",0,"",0,"",0,"",0,null,"",null,0,"",null,0,"",null,0,"",null,"",0,"",0,0]
[null,null,null,null,null,"",0,"",0,"",0,"",0,"",0,"",0,null,"",null,0,"",null,0,"",null,0,"",null,"",0,"",0,0]
[null,null,null,null,null,"",0,"",0,"",0,"",0,"",0,"",0,null,"",null,0,{"$f":"IF(Y173=\"\",\"\",Y173-(X173*7))","v":""},null,0,"",null,0,"",null,"",0,"",0,0]
[null,null,null,null,null,"",0,"",0,"",0,"",0,"",0,"",0,null,"",null,0,{"$f":"IF(Y174=\"\",\"\",Y174-(X174*7))","v":""},null,0,"",null,0,"",null,"",0,"",0,0]
[null,null,null,null,null,"",0,"",0,"",0,"",0,"",0,"",0,null,"",null,0,"",null,0,"",null,0,"",null,"",0,"",0,0]
[null,null,null,null,null,"",0,"",0,"",0,"",0,"",0,"",0,null,"",null,0,"",null,0,"",null,0,"",null,"",0,"",0,0]
[null,null,null,null,null,"",0,"",0,"",0,"",0,"",0,"",0,null,"",null,0,"",null,0,"",null,0,"",null,"",0,"",0,0]
[null,null,null,null,null,"",0,"",0,"",0,"",0,"",0,"",0,null,"",null,0,"",null,0,"",null,0,"",null,"",0,"",0,0]
[null,null,null,null,null,"",0,"",0,"",0,"",0,"",0,"",0,null,"",null,0,"",null,0,"",null,0,"",null,"",0,"",0,0]
[null,null,null,null,null,"",0,"",0,"",0,"",0,"",0,"",0,null,"",null,0,"",null,0,"",null,0,"",null,"",0,"",0,0]
[null,null,null,null,null,"",0,"",0,"",0,"",0,"",0,"",0,null,"",null,0,"",null,0,"",null,0,"",null,"",0,"",0,0]
[null,null,null,null,null,"",0,"",0,"",0,"",0,"",0,"",0,null,"",null,0,"",null,0,"",null,0,"",null,"",0,"",0,0]
[null,null,null,null,null,"",0,"",0,"",0,"",0,"",0,"",0,null,"",null,0,"",null,0,"",null,0,"",null,"",0,"",0,0]
[null,null,null,null,null,"",0,"",0,"",0,"",0,"",0,"",0,null,"",null,0,"",null,0,"",null,0,"",null,"",0,"",0,0]
[null,null,null,null,null,"",0,"",0,"",0,"",0,"",0,"",0,null,"",null,0,"",null,0,"",null,0,"",null,"",0,"",0,0]
[null,"**ITEMS IN RED ARE IN TROUBLE** ",null,null,null,null,null,null,null,null,null,null,null,null,null,null,null,null,null,null,null,null,null,null,null,null,null,null,null,null,null,null,null,null,null,null,null,"LAST DATE REVIEWED W/ SUPER: "]

{"sheet":"Full Norm - Example","index":5,"n_rows":122,"n_cols":512,"rows_kept":122,"cut":false,"hidden":false,"merged":[[10,15,12,16],[40,26,71,26],[2,497,2,501],[2,502,2,506],[2,507,2,511],[5,15,6,20],[7,15,9,16],[2,467,2,471],[2,472,2,476],[2,477,2,481],[2,482,2,486],[2,487,2,491],[2,492,2,496],[2,437,2,441],[2,442,2,446],[2,447,2,451],[2,452,2,456],[2,457,2,461],[2,462,2,466],[2,407,2,411],[2,412,2,416],[2,417,2,421],[2,422,2,426],[2,427,2,431],[2,432,2,436],[2,377,2,381],[2,382,2,386],[2,387,2,391],[2,392,2,396],[2,397,2,401],[2,402,2,406],[2,347,2,351],[2,352,2,356],[2,357,2,361],[2,362,2,366],[2,367,2,371],[2,372,2,376],[2,317,2,321],[2,322,2,326],[2,327,2,331],[2,332,2,336],[2,337,2,341],[2,342,2,346],[2,292,2,296],[2,297,2,301],[2,302,2,306],[2,307,2,311],[2,312,2,316],[2,287,2,291],[2,142,2,146],[2,147,2,151],[2,152,2,156],[2,157,2,161],[2,162,2,166],[2,227,2,231],[2,232,2,236],[2,237,2,241],[2,242,2,246],[2,257,2,261],[2,262,2,266],[2,267,2,271],[2,272,2,276],[2,277,2,281],[2,282,2,286],[2,247,2,251],[2,252,2,256],[2,197,2,201],[2,202,2,206],[2,207,2,211],[2,212,2,216],[2,217,2,221],[2,222,2,226],[2,17,2,21],[2,22,2,26],[2,27,2,31],[2,32,2,36],[2,37,2,41],[2,42,2,46],[2,107,2,111],[2,112,2,116],[2,117,2,121],[2,77,2,81],[2,82,2,86],[2,87,2,91],[2,92,2,96],[2,97,2,101],[2,102,2,106],[1,469,1,490],[1,491,1,511],[1,252,1,273],[1,274,1,293],[1,294,1,316],[1,317,1,336],[1,337,1,359],[1,360,1,381],[2,47,2,51],[2,52,2,56],[2,57,2,61],[2,62,2,66],[2,67,2,71],[2,72,2,76],[2,122,2,126],[2,127,2,131],[2,132,2,136],[2,167,2,171],[2,172,2,176],[2,177,2,181],[2,182,2,186],[2,187,2,191],[2,192,2,196],[2,137,2,141],[1,122,1,141],[1,142,1,166],[1,167,1,186],[1,187,1,211],[1,212,1,231],[1,232,1,251],[0,403,0,425],[0,426,0,446],[0,447,0,468],[0,122,0,141],[1,382,1,402],[1,403,1,425],[1,426,1,446],[1,447,1,468],[0,469,0,490],[0,491,0,511],[1,17,1,36],[1,37,1,56],[1,57,1,76],[1,77,1,101],[1,102,1,121],[0,274,0,293],[0,294,0,316],[0,317,0,336],[0,337,0,359],[0,360,0,381],[0,382,0,402],[0,142,0,166],[0,167,0,186],[0,187,0,211],[0,212,0,231],[0,232,0,251],[0,252,0,273],[0,17,0,36],[0,37,0,56],[0,57,0,76],[0,77,0,101],[0,102,0,121]]}
[null,null,null,null,null,null,null,null,null,null,null,null,null,null,null,null,null,{"$f":"YEAR(R4)","v":2022},null,null,null,null,null,null,null,null,null,null,null,null,null,null,null,null,null,null,null,{"$f":"YEAR(AL4)","v":2022},null,null,null,null,null,null,null,null,null,null,null,null,null,null,null,null,null,null,null,{"$f":"YEAR(BF4)","v":2022},null,null,null,null,null,null,null,null,null,null,null,null,null,null,null,null,null,null,null,{"$f":"YEAR(BZ4)","v":2022},null,null,null,null,null,null,null,null,null,null,null,null,null,null,null,null,null,null,null,null,null,null,null,null,{"$f":"YEAR(CY4)","v":2022},null,null,null,null,null,null,null,null,null,null,null,null,null,null,null,null,null,null,null,{"$f":"YEAR(DS4)","v":2022},null,null,null,null,null,null,null,null,null,null,null,null,null,null,null,null,null,null,null,{"$f":"YEAR(EM4)","v":2022},null,null,null,null,null,null,null,null,null,null,null,null,null,null,null,null,null,null,null,null,null,null,null,null,{"$f":"YEAR(FL4)","v":2022},null,null,null,null,null,null,null,null,null,null,null,null,null,null,null,null,null,null,null,{"$f":"YEAR(GF4)","v":2022},null,null,null,null,null,null,null,null,null,null,null,null,null,null,null,null,null,null,null,null,null,null,null,null,{"$f":"YEAR(HE4)","v":2022},null,null,null,null,null,null,null,null,null,null,null,null,null,null,null,null,null,null,null,{"$f":"YEAR(HY4)","v":2022},null,null,null,null,null,null,null,null,null,null,null,null,null,null,null,null,null,null,null,{"$f":"YEAR(IS4)","v":2023},null,null,null,null,null,null,null,null,null,null,null,null,null,null,null,null,null,null,null,null,null,{"$f":"YEAR(JO4)","v":2023},null,null,null,null,null,null,null,null,null,null,null,null,null,null,null,null,null,null,null,{"$f":"YEAR(KI4)","v":2023},null,null,null,null,null,null,null,null,null,null,null,null,null,null,null,null,null,null,null,null,null,null,{"$f":"YEAR(LF4)","v":2023},null,null,null,null,null,null,null,null,null,null,null,null,null,null,null,null,null,null,null,{"$f":"YEAR(LZ4)","v":2023},null,null,null,null,null,null,null,null,null,null,null,null,null,null,null,null,null,null,null,null,null,null,{"$f":"YEAR(MY4)","v":2023},null,null,null,null,null,null,null,null,null,null,null,null,null,null,null,null,null,null,null,null,null,{"$f":"YEAR(NS4)","v":2023},null,null,null,null,null,null,null,null,null,null,null,null,null,null,null,null,null,null,null,null,{"$f":"YEAR(ON4)","v":2023},null,null,null,null,null,null,null,null,null,null,null,null,null,null,null,null,null,null,null,null,null,null,{"$f":"YEAR(PK4)","v":2023},null,null,null,null,null,null,null,null,null,null,null,null,null,null,null,null,null,null,null,null,{"$f":"YEAR(QF4)","v":2023},null,null,null,null,null,null,null,null,null,null,null,null,null,null,null,null,null,null,null,null,null,{"$f":"YEAR(RB4)","v":2023},null,null,null,null,null,null,null,null,null,null,null,null,null,null,null,null,null,null,null,null,null,{"$f":"YEAR(RX4)","v":2023}]
[null,null,null,null,null,null,null,null,null,null,null,null,null,null,null,null,null,"February",null,null,null,null,null,null,null,null,null,null,null,null,null,null,null,null,null,null,null,"March",null,null,null,null,null,null,null,null,null,null,null,null,null,null,null,null,null,null,null,"April",null,null,null,null,null,null,null,null,null,null,null,null,null,null,null,null,null,null,null,"May",null,null,null,null,null,null,null,null,null,null,null,null,null,null,null,null,null,null,null,null,null,null,null,null,"June",null,null,null,null,null,null,null,null,null,null,null,null,null,null,null,null,null,null,null,"July",null,null,null,null,null,null,null,null,null,null,null,null,null,null,null,null,null,null,null,"August",null,null,null,null,null,null,null,null,null,null,null,null,null,null,null,null,null,null,null,null,null,null,null,null,"September",null,null,null,null,null,null,null,null,null,null,null,null,null,null,null,null,null,null,null,"October",null,null,null,null,null,null,null,null,null,null,null,null,null,null,null,null,null,null,null,null,null,null,null,null,"November",null,null,null,null,null,null,null,null,null,null,null,null,null,null,null,null,null,null,null,"December",null,null,null,null,null,null,null,null,null,null,null,null,null,null,null,null,null,null,null,"January",null,null,null,null,null,null,null,null,null,null,null,null,null,null,null,null,null,null,null,null,null,"February",null,null,null,null,null,null,null,null,null,null,null,null,null,null,null,null,null,null,null,"March",null,null,null,null,null,null,null,null,null,null,null,null,null,null,null,null,null,null,null,null,null,null,"April",null,null,null,null,null,null,null,null,null,null,null,null,null,null,null,null,null,null,null,"May",null,null,null,null,null,null,null,null,null,null,null,null,null,null,null,null,null,null,null,null,null,null,"June",null,null,null,null,null,null,null,null,null,null,null,null,null,null,null,null,null,null,null,null,null,"July",null,null,null,null,null,null,null,null,null,null,null,null,null,null,null,null,null,null,null,null,"August",null,null,null,null,null,null,null,null,null,null,null,null,null,null,null,null,null,null,null,null,null,null,"September",null,null,null,null,null,null,null,null,null,null,null,null,null,null,null,null,null,null,null,null,"October",null,null,null,null,null,null,null,null,null,null,null,null,null,null,null,null,null,null,null,null,null,"November",null,null,null,null,null,null,null,null,null,null,null,null,null,null,null,null,null,null,null,null,null,"December"]
[null,null,null,null,null,null,null,null,null,null,null,null,null,null,null,null,null,"2022-02-07",null,null,null,null,"2022-02-14",null,null,null,null,"2022-02-21",null,null,null,null,"2022-02-28",null,null,null,null,"2022-03-07",null,null,null,null,"2022-03-14",null,null,null,null,"2022-03-21",null,null,null,null,"2022-03-28",null,null,null,null,"2022-04-04",null,null,null,null,"2022-04-11",null,null,null,null,"2022-04-18",null,null,null,null,"2022-04-25",null,null,null,null,"2022-05-02",null,null,null,null,"2022-05-09",null,null,null,null,"2022-05-16",null,null,null,null,"2022-05-23",null,null,null,null,"2022-05-30",null,null,null,null,"2022-06-06",null,null,null,null,"2022-06-13",null,null,null,null,"2022-06-20",null,null,null,null,"2022-06-27",null,null,null,null,"2022-07-04",null,null,null,null,"2022-07-11",null,null,null,null,"2022-07-18",null,null,null,null,"2022-07-25",null,null,null,null,"2022-08-01",null,null,null,null,"2022-08-08",null,null,null,null,"2022-08-15",null,null,null,null,"2022-08-22",null,null,null,null,"2022-08-29",null,null,null,null,"2022-09-05",null,null,null,null,"2022-09-12",null,null,null,null,"2022-09-19",null,null,null,null,"2022-09-26",null,null,null,null,"2022-10-03",null,null,null,null,"2022-10-10",null,null,null,null,"2022-10-17",null,null,null,null,"2022-10-24",null,null,null,null,"2022-10-31",null,null,null,null,"2022-11-07",null,null,null,null,"2022-11-14",null,null,null,null,"2022-11-21",null,null,null,null,"2022-11-28",null,null,null,null,"2022-12-05",null,null,null,null,"2022-12-12",null,null,null,null,"2022-12-19",null,null,null,null,"2022-12-26",null,null,null,null,"2023-01-02",null,null,null,null,"2023-01-09",null,null,null,null,"2023-01-16",null,null,null,null,"2023-01-23",null,null,null,null,"2023-01-30",null,null,null,null,"2023-02-06",null,null,null,null,"2023-02-13",null,null,null,null,"2023-02-20",null,null,null,null,"2023-02-27",null,null,null,null,"2023-03-06",null,null,null,null,"2023-03-13",null,null,null,null,"2023-03-20",null,null,null,null,"2023-03-27",null,null,null,null,"2023-04-03",null,null,null,null,"2023-04-10",null,null,null,null,"2023-04-17",null,null,null,null,"2023-04-24",null,null,null,null,"2023-05-01",null,null,null,null,"2023-05-08",null,null,null,null,"2023-05-15",null,null,null,null,"2023-05-22",null,null,null,null,"2023-05-29",null,null,null,null,"2023-06-05",null,null,null,null,"2023-06-12",null,null,null,null,"2023-06-19",null,null,null,null,"2023-06-26",null,null,null,null,"2023-07-03",null,null,null,null,"2023-07-10",null,null,null,null,"2023-07-17",null,null,null,null,"2023-07-24",null,null,null,null,"2023-07-31",null,null,null,null,"2023-08-07",null,null,null,null,"2023-08-14",null,null,null,null,"2023-08-21",null,null,null,null,"2023-08-28",null,null,null,null,"2023-09-04",null,null,null,null,"2023-09-11",null,null,null,null,"2023-09-18",null,null,null,null,"2023-09-25",null,null,null,null,"2023-10-02",null,null,null,null,"2023-10-09",null,null,null,null,"2023-10-16",null,null,null,null,"2023-10-23",null,null,null,null,"2023-10-30",null,null,null,null,"2023-11-06",null,null,null,null,"2023-11-13",null,null,null,null,"2023-11-20",null,null,null,null,"2023-11-27",null,null,null,null,"2023-12-04",null,null,null,null,"2023-12-11","2023-12-12","2023-12-13","2023-12-14","2023-12-15","2023-12-18","2023-12-19","2023-12-20","2023-12-21","2023-12-22","2023-12-25","2023-12-26","2023-12-27","2023-12-28","2023-12-29"]
[null,null,null,null,null,null,null,null,null,null,null,null,null,null,null,null,null,"2022-02-07","2022-02-08","2022-02-09","2022-02-10","2022-02-11","2022-02-14","2022-02-15","2022-02-16","2022-02-17","2022-02-18","2022-02-21","2022-02-22","2022-02-23","2022-02-24","2022-02-25","2022-02-28","2022-03-01","2022-03-02","2022-03-03","2022-03-04","2022-03-07","2022-03-08","2022-03-09","2022-03-10","2022-03-11","2022-03-14","2022-03-15","2022-03-16","2022-03-17","2022-03-18","2022-03-21","2022-03-22","2022-03-23","2022-03-24","2022-03-25","2022-03-28","2022-03-29","2022-03-30","2022-03-31","2022-04-01","2022-04-04","2022-04-05","2022-04-06","2022-04-07","2022-04-08","2022-04-11","2022-04-12","2022-04-13","2022-04-14","2022-04-15","2022-04-18","2022-04-19","2022-04-20","2022-04-21","2022-04-22","2022-04-25","2022-04-26","2022-04-27","2022-04-28","2022-04-29","2022-05-02","2022-05-03","2022-05-04","2022-05-05","2022-05-06","2022-05-09","2022-05-10","2022-05-11","2022-05-12","2022-05-13","2022-05-16","2022-05-17","2022-05-18","2022-05-19","2022-05-20","2022-05-23","2022-05-24","2022-05-25","2022-05-26","2022-05-27","2022-05-30","2022-05-31","2022-06-01","2022-06-02","2022-06-03","2022-06-06","2022-06-07","2022-06-08","2022-06-09","2022-06-10","2022-06-13","2022-06-14","2022-06-15","2022-06-16","2022-06-17","2022-06-20","2022-06-21","2022-06-22","2022-06-23","2022-06-24","2022-06-27","2022-06-28","2022-06-29","2022-06-30","2022-07-01","2022-07-04","2022-07-05","2022-07-06","2022-07-07","2022-07-08","2022-07-11","2022-07-12","2022-07-13","2022-07-14","2022-07-15","2022-07-18","2022-07-19","2022-07-20","2022-07-21","2022-07-22","2022-07-25","2022-07-26","2022-07-27","2022-07-28","2022-07-29","2022-08-01","2022-08-02","2022-08-03","2022-08-04","2022-08-05","2022-08-08","2022-08-09","2022-08-10","2022-08-11","2022-08-12","2022-08-15","2022-08-16","2022-08-17","2022-08-18","2022-08-19","2022-08-22","2022-08-23","2022-08-24","2022-08-25","2022-08-26","2022-08-29","2022-08-30","2022-08-31","2022-09-01","2022-09-02","2022-09-05","2022-09-06","2022-09-07","2022-09-08","2022-09-09","2022-09-12","2022-09-13","2022-09-14","2022-09-15","2022-09-16","2022-09-19","2022-09-20","2022-09-21","2022-09-22","2022-09-23","2022-09-26","2022-09-27","2022-09-28","2022-09-29","2022-09-30","2022-10-03","2022-10-04","2022-10-05","2022-10-06","2022-10-07","2022-10-10","2022-10-11","2022-10-12","2022-10-13","2022-10-14","2022-10-17","2022-10-18","2022-10-19","2022-10-20","2022-10-21","2022-10-24","2022-10-25","2022-10-26","2022-10-27","2022-10-28","2022-10-31","2022-11-01","2022-11-02","2022-11-03","2022-11-04","2022-11-07","2022-11-08","2022-11-09","2022-11-10","2022-11-11","2022-11-14","2022-11-15","2022-11-16","2022-11-17","2022-11-18","2022-11-21","2022-11-22","2022-11-23","2022-11-24","2022-11-25","2022-11-28","2022-11-29","2022-11-30","2022-12-01","2022-12-02","2022-12-05","2022-12-06","2022-12-07","2022-12-08","2022-12-09","2022-12-12","2022-12-13","2022-12-14","2022-12-15","2022-12-16","2022-12-19","2022-12-20","2022-12-21","2022-12-22","2022-12-23","2022-12-26","2022-12-27","2022-12-28","2022-12-29","2022-12-30","2023-01-02","2023-01-03","2023-01-04","2023-01-05","2023-01-06","2023-01-09","2023-01-10","2023-01-11","2023-01-12","2023-01-13","2023-01-16","2023-01-17","2023-01-18","2023-01-19","2023-01-20","2023-01-23","2023-01-24","2023-01-25","2023-01-26","2023-01-27","2023-01-30","2023-01-31","2023-02-01","2023-02-02","2023-02-03","2023-02-06","2023-02-07","2023-02-08","2023-02-09","2023-02-10","2023-02-13","2023-02-14","2023-02-15","2023-02-16","2023-02-17","2023-02-20","2023-02-21","2023-02-22","2023-02-23","2023-02-24","2023-02-27","2023-02-28","2023-03-01","2023-03-02","2023-03-03","2023-03-06","2023-03-07","2023-03-08","2023-03-09","2023-03-10","2023-03-13","2023-03-14","2023-03-15","2023-03-16","2023-03-17","2023-03-20","2023-03-21","2023-03-22","2023-03-23","2023-03-24","2023-03-27","2023-03-28","2023-03-29","2023-03-30","2023-03-31","2023-04-03","2023-04-04","2023-04-05","2023-04-06","2023-04-07","2023-04-10","2023-04-11","2023-04-12","2023-04-13","2023-04-14","2023-04-17","2023-04-18","2023-04-19","2023-04-20","2023-04-21","2023-04-24","2023-04-25","2023-04-26","2023-04-27","2023-04-28","2023-05-01","2023-05-02","2023-05-03","2023-05-04","2023-05-05","2023-05-08","2023-05-09","2023-05-10","2023-05-11","2023-05-12","2023-05-15","2023-05-16","2023-05-17","2023-05-18","2023-05-19","2023-05-22","2023-05-23","2023-05-24","2023-05-25","2023-05-26","2023-05-29","2023-05-30","2023-05-31","2023-06-01","2023-06-02","2023-06-05","2023-06-06","2023-06-07","2023-06-08","2023-06-09","2023-06-12","2023-06-13","2023-06-14","2023-06-15","2023-06-16","2023-06-19","2023-06-20","2023-06-21","2023-06-22","2023-06-23","2023-06-26","2023-06-27","2023-06-28","2023-06-29","2023-06-30","2023-07-03","2023-07-04","2023-07-05","2023-07-06","2023-07-07","2023-07-10","2023-07-11","2023-07-12","2023-07-13","2023-07-14","2023-07-17","2023-07-18","2023-07-19","2023-07-20","2023-07-21","2023-07-24","2023-07-25","2023-07-26","2023-07-27","2023-07-28","2023-07-31","2023-08-01","2023-08-02","2023-08-03","2023-08-04","2023-08-07","2023-08-08","2023-08-09","2023-08-10","2023-08-11","2023-08-14","2023-08-15","2023-08-16","2023-08-17","2023-08-18","2023-08-21","2023-08-22","2023-08-23","2023-08-24","2023-08-25","2023-08-28","2023-08-29","2023-08-30","2023-08-31","2023-09-01","2023-09-04","2023-09-05","2023-09-06","2023-09-07","2023-09-08","2023-09-11","2023-09-12","2023-09-13","2023-09-14","2023-09-15","2023-09-18","2023-09-19","2023-09-20","2023-09-21","2023-09-22","2023-09-25","2023-09-26","2023-09-27","2023-09-28","2023-09-29","2023-10-02","2023-10-03","2023-10-04","2023-10-05","2023-10-06","2023-10-09","2023-10-10","2023-10-11","2023-10-12","2023-10-13","2023-10-16","2023-10-17","2023-10-18","2023-10-19","2023-10-20","2023-10-23","2023-10-24","2023-10-25","2023-10-26","2023-10-27","2023-10-30","2023-10-31","2023-11-01","2023-11-02","2023-11-03","2023-11-06","2023-11-07","2023-11-08","2023-11-09","2023-11-10","2023-11-13","2023-11-14","2023-11-15","2023-11-16","2023-11-17","2023-11-20","2023-11-21","2023-11-22","2023-11-23","2023-11-24","2023-11-27","2023-11-28","2023-11-29","2023-11-30","2023-12-01","2023-12-04","2023-12-05","2023-12-06","2023-12-07","2023-12-08","2023-12-11","2023-12-12","2023-12-13","2023-12-14","2023-12-15","2023-12-18","2023-12-19","2023-12-20","2023-12-21","2023-12-22","2023-12-25","2023-12-26","2023-12-27","2023-12-28","2023-12-29"]
[null,null,null,null,null,null,null,null,null,null,null,null,null,null,null,null,null,"M","T","W","TH","F","M","T","W","TH","F","M","T","W","TH","F","M","T","W","TH","F","M","T","W","TH","F","M","T","W","TH","F","M","T","W","TH","F","M","T","W","TH","F","M","T","W","TH","F","M","T","W","TH","F","M","T","W","TH","F","M","T","W","TH","F","M","T","W","TH","F","M","T","W","TH","F","M","T","W","TH","F","M","T","W","TH","F","M","T","W","TH","F","M","T","W","TH","F","M","T","W","TH","F","M","T","W","TH","F","M","T","W","TH","F","M","T","W","TH","F","M","T","W","TH","F","M","T","W","TH","F","M","T","W","TH","F","M","T","W","TH","F","M","T","W","TH","F","M","T","W","TH","F","M","T","W","TH","F","M","T","W","TH","F","M","T","W","TH","F","M","T","W","TH","F","M","T","W","TH","F","M","T","W","TH","F","M","T","W","TH","F","M","T","W","TH","F","M","T","W","TH","F","M","T","W","TH","F","M","T","W","TH","F","M","T","W","TH","F","M","T","W","TH","F","M","T","W","TH","F","M","T","W","TH","F","M","T","W","TH","F","M","T","W","TH","F","M","T","W","TH","F","M","T","W","TH","F","M","T","W","TH","F","M","T","W","TH","F","M","T","W","TH","F","M","T","W","TH","F","M","T","W","TH","F","M","T","W","TH","F","M","T","W","TH","F","M","T","W","TH","F","M","T","W","TH","F","M","T","W","TH","F","M","T","W","TH","F","M","T","W","TH","F","M","T","W","TH","F","M","T","W","TH","F","M","T","W","TH","F","M","T","W","TH","F","M","T","W","TH","F","M","T","W","TH","F","M","T","W","TH","F","M","T","W","TH","F","M","T","W","TH","F","M","T","W","TH","F","M","T","W","TH","F","M","T","W","TH","F","M","T","W","TH","F","M","T","W","TH","F","M","T","W","TH","F","M","T","W","TH","F","M","T","W","TH","F","M","T","W","TH","F","M","T","W","TH","F","M","T","W","TH","F","M","T","W","TH","F","M","T","W","TH","F","M","T","W","TH","F","M","T","W","TH","F","M","T","W","TH","F","M","T","W","TH","F","M","T","W","TH","F","M","T","W","TH","F","M","T","W","TH","F","M","T","W","TH","F","M","T","W","TH","F","M","T","W","TH","F","M","T","W","TH","F","M","T","W","TH","F","M","T","W","TH","F","M","T","W","TH","F","M","T","W","TH","F","M","T","W","TH","F","M","T","W","TH","F","M","T","W","TH","F"]
["PRE-CON MEETINGS","PRE-CON MEETINGS","PRE-CON MEETINGS",null,null,null,null,null,null,null,null,null,null,null,null,"PRE-CON MEETINGS",null,null,null,null,null,null,null,null,null,null,null,null,null,null,null,null,null,null,null,null,null,null,null,null,null,null,null,null,null,null,null,null,null,null,null,null,null,null,null,null,null,null,null,null,null,null,null,null,null,null,null,null,null,null,null,null,null,null,null,null,null,null,null,null,null,null,null,null,null,null,null,null,null,null,null,null,null,null,null,null,null,null,null,null,null,null,null,null,null,null,null,null,null,null,null,null,null,null,null,null,null,null,null,null,null,null,null,null,null,null,null,null,null,null,null,null,null,null,null,null,null,null,null,null,null,null,null,null,null,null,null,null,null,null,null,null,null,null,null,null,null,null,null,null,null,null,null,null,null,null,null,null,null,null,null,null,null,null,null,null,null,null,null,null,null,null,null,null,null,null,null,null,null,null,null,null,null,null,null,null,null,null,null,null,null,null,null,null,null,null,null,null,null,null,null,null,null,null,null,null,null,null,null,null,null,null,null,null,null,null,null,null,null,null,null,null,null,null,null,null,null,null,null,null,null,null,null,null,null,null,null,null,null,null,null,null,null,null,null,null,null,null,null,null,null,null,null,null,null,null,null,null,null,null,null,null,null,null,null,null,"North Exterioirs EIFS"]
["PRE-CON MEETINGS","PRE-CON MEETINGS","PRE-CON MEETINGS",null,null,null,null,null,null,null,null,null,null,null,null,null,null,null,null,null,null,null,null,null,null,null,null,null,null,null,null,null,null,null,null,null,null,null,null,null,null,null,null,null,null,null,null,null,null,null,null,null,null,null,null,null,null,null,null,null,null,null,null,null,null,null,null,null,null,null,null,null,null,null,null,null,null,null,null,null,null,null,null,null,null,null,null,null,null,null,null,null,null,null,null,null,null,null,null,null,null,null,null,null,null,null,null,null,null,null,null,null,null,null,null,null,null,null,null,null,null,null,null,null,null,null,null,null,null,null,null,null,null,null,null,null,null,null,null,null,null,null,null,null,null,null,null,null,null,null,null,null,null,null,null,null,null,null,null,null,null,null,null,null,null,null,null,null,null,null,null,null,null,null,null,null,null,null,null,null,null,null,null,null,null,null,null,null,null,null,null,null,null,null,null,null,null,null,null,null,null,null,null,null,null,null,null,null,null,null,null,null,null,null,null,null,null,null,null,null,null,null,null,null,null,null,null,null,null,null,null,null,null,null,null,null,null,null,null,null,null,null,null,null,null,null,null,null,null,null,null,null,null,null,null,null,null,null,null,null,null,null,null,null,null,null,"Level 2 Zone E&F Framing",null,null,null,null,null,null,null,null,null,"Level 3 Fire Sprinkler",null,null,null,null,"Level 3 OH MEP"]
["MILESTONES","MILESTONES","MILESTONES",null,null,null,null,null,null,null,null,null,null,null,null,"MILESTONES",null,null,null,null,null,null,null,null,null,null,null,null,null,null,null,null,null,null,null,null,null,null,null,null,null,null,null,null,null,null,null,null,null,null,null,null,null,null,null,null,null,null,null,null,null,null,null,null,null,null,null,null,null,null,null,null,null,null,null,null,null,null,null,null,null,null,null,null,null,null,null,null,null,null,null,null,null,null,null,null,null,null,null,null,null,null,null,null,null,null,null,null,null,null,null,null,null,null,null,null,null,null,null,null,null,null,null,null,null,null,null,null,null,null,null,null,null,null,null,null,null,null,null,null,null,null,null,null,null,null,null,null,null,null,null,null,null,null,null,null,null,null,null,null,null,null,null,null,null,null,null,null,null,null,null,null,null,null,null,null,null,null,null,null,null,null,null,null,null,null,null,null,null,null,null,null,null,null,null,null,null,null,null,null,null,null,null,null,null,null,null,null,null,null,null,null,null,null,null,null,null,null,null,null,null,null,null,null,null,null,null,null,null,null,null,null,null,null,null,null,null,null,null,null,null,null,null,null,null,null,null,null,null,null,null,null,null,null,null,null,null,null,null,null,null,null,null,null,null,null,null,null,null,null,null,null,null,null,null,null,null,null,null,null,null,null,null,null,null,null,null,null,null,null,null,null,null,null,null,null,null,null,null,null,null,null,null,null,null,null,null,null,null,null,null,null,null,null,null,null,null,null,null,null,null,null,null,null,null,null,null,null,null,"🔶","Air On"]
["MILESTONES","MILESTONES","MILESTONES",null,null,null,null,null,null,null,null,null,null,null,null,null,null,null,null,null,null,null,null,null,null,null,null,"🔶","Notice to Proceed",null,null,null,null,null,null,null,null,null,null,null,null,null,null,null,null,null,null,null,null,null,null,null,null,null,null,null,null,null,null,null,null,null,null,null,null,null,null,null,null,null,null,null,null,null,null,null,null,null,null,null,null,null,null,null,null,null,null,null,null,null,null,null,"🔷","Sitework Complete",null,null,null,null,null,null,null,null,null,null,null,null,null,null,null,null,null,null,null,null,null,null,null,null,null,null,null,null,null,null,null,null,null,null,null,null,null,null,null,null,null,null,null,null,null,null,null,null,null,null,null,null,null,null,null,null,null,null,null,null,"🔷","Foundation Complete",null,null,null,null,null,null,null,null,null,null,null,null,null,null,null,null,null,null,null,null,null,null,null,null,null,null,null,null,null,null,null,null,null,null,null,null,null,null,null,null,null,null,null,null,null,null,null,null,null,null,null,null,null,null,null,null,null,null,null,null,null,null,null,"🔷","Structure complete",null,null,null,null,null,null,null,null,null,null,null,null,null,null,null,null,null,null,null,null,null,null,null,null,null,null,null,null,null,null,null,null,null,null,null,null,null,null,null,null,null,null,null,null,null,null,null,null,null,null,null,null,null,null,null,null,null,null,null,null,null,null,null,null,null,null,null,null,null,null,null,null,null,null,null,null,null,null,null,null,null,null,null,null,null,null,"🔶","Power On",null,null,null,null,null,null,null,null,null,"🔷","Exterior Complete",null,null,null,null,null,null,null,null,null,null,null,null,null,null,null,null,null,null,null,null,null,null,null,null,null,null,null,null,null,null,null,null,null,null,null,null,null,null,null,null,null,null,null,null,null,null,null,null,null,null,null,null,null,null,null,null,null,null,null,null,null,null,null,null,null,null,null,null,null,null,"🔷","Interior Complete",null,null,null,null,null,null,null,null,null,null,null,null,null,null,null,null,null,null,null,null,null,null,null,null,null,null,null,null,null,null,"🔶","Substantial Completion",null,null,null,null,null,null,null,null,null,null,null,null,null,null,null,null,null,null,"🔶","Final Completion + Financial Completion"]
["MILESTONES","MILESTONES","MILESTONES"]
["PROCUREMENT","PROCUREMENT","PROCUREMENT",null,null,null,null,null,null,null,null,null,null,null,null,"PROCUREMENT",null,null,null,null,null,null,null,null,null,null,null,null,null,null,null,null,null,null,null,null,null,null,null,null,null,null,null,null,null,null,null,null,null,null,null,null,null,null,null,null,null,null,null,null,null,null,null,null,null,null,null,null,null,null,null,null,null,null,null,null,null,null,null,null,null,null,null,null,null,null,null,null,null,null,null,null,null,null,null,null,null,null,null,null,null,null,null,null,null,null,null,null,null,null,null,null,null,null,null,null,null,null,null,null,null,null,null,null,null,null,null,null,null,null,null,null,null,null,null,null,null,null,null,null,null,null,null,null,null,null,null,null,null,null,null,null,null,null,null,null,null,"Electrical Gear",null,null,null,null,null,null,null,null,null,null,null,null,null,null,null,null,null,null,null,null,null,null,null,null,null,null,null,null,null,null,null,null,null,null,null,null,null,null,null,null,null,null,null,null,null,null,null,null,null,null,null,null,null,null,null,null,null,null,null,null,null,null,null,null,null,null,null,null,null,null,null,null,null,null,null,null,null,null,null,null,null,null,null,null,null,null,null,null,null,null,null,null,null,null,null,null,null,null,null,null,null,null,null,null,null,null,null,null,null,null,null,null,null,null,"SES Fit-out & Energize"]
["PROCUREMENT","PROCUREMENT","PROCUREMENT",null,null,null,null,null,null,null,null,null,null,null,null,null,null,null,null,null,null,null,null,null,null,null,null,null,null,null,null,null,null,null,null,null,null,null,null,null,null,null,null,null,null,null,null,null,null,null,null,null,null,null,null,null,null,null,null,null,null,null,null,null,null,null,null,null,null,null,null,null,null,null,null,null,null,null,null,null,null,null,null,null,null,null,null,null,null,null,null,null,null,null,null,null,null,null,null,null,null,null,null,null,null,null,null,null,null,null,null,null,null,null,null,null,null,null,null,null,null,null,null,null,null,null,null,null,null,null,null,null,null,null,null,null,null,null,null,null,null,null,null,null,null,null,null,null,null,null,null,null,"HVAC Equipment"]
["PROCUREMENT","PROCUREMENT","PROCUREMENT",null,null,null,null,null,null,null,null,null,null,null,null,null,null,null,null,null,null,null,null,null,null,null,null,null,null,null,null,null,null,null,null,null,null,null,null,null,null,null,null,null,null,null,null,null,null,null,null,null,null,null,null,null,null,null,null,null,null,null,null,null,null,null,null,null,null,null,null,null,null,null,null,null,null,null,null,null,null,null,null,null,null,null,null,null,null,null,null,null,null,null,null,null,null,null,null,null,null,null,null,null,null,null,null,null,null,null,null,null,null,null,null,null,null,null,null,null,null,null,"Windows"]
["Phase","Area","Zone",null,null,null,null,null,null,null,null,null,null,null,null,null,null,null,null,null,null,null,null,null,null,null,null,null,null,null,null,null,null,null,null,null,null,null,null,null,null,null,null,null,null,null,null,null,null,null,null,null,null,null,null,null,null,null,null,null,null,null,null,null,null,null,null,null,null,null,null,null,null,null,null,null,null,null,null,null,null,null,null,null,null,null,null,null,null,null,null,null,null,null,null,null,null,"H",null,null,null,null,null,null,null,null,null,null,null,null,null,null,null,null,null,null,null,null,null,null,null,null,"H",null,null,null,null,null,null,null,null,null,null,null,null,null,null,null,null,null,null,null,null,null,null,null,null,null,null,null,null,null,null,null,null,null,null,null,null,null,null,null,null,null,null,null,null,null,null,"H",null,null,null,null,null,null,null,null,null,null,null,null,null,null,null,null,null,null,null,null,null,null,null,null,null,null,null,null,null,null,null,null,null,null,null,null,null,null,null,null,null,null,null,null,null,null,null,null,null,null,null,null,null,"H","H","H","H",null,null,null,null,null,null,null,null,null,null,null,null,null,null,null,null,null,null,null,null,"H","H",null,null,null,null,null,null,null,null,null,null,null,null,null,null,null,null,null,null,null,null,null,null,null,null,null,null,null,null,null,null,null,null,null,null,null,null,null,null,null,null,null,null,null,null,null,null,null,null,null,null,null,null,null,null,null,null,null,null,null,null,null,null,null,null,null,null,null,null,null,null,null,null,null,null,null,null,null,null,null,null,null,null,null,null,null,null,null,null,null,null,null,null,null,null,null,null,null,null,null,null,null,null,null,null,null,null,null,null,"H",null,null,null,null,null,null,null,null,null,null,null,null,null,null,null,null,null,null,null,null,null,null,null,null,null,"H",null,null,null,null,null,null,null,null,null,null,null,null,null,null,null,null,null,null,null,null,null,null,null,null,null,null,null,null,null,null,null,null,null,null,null,null,null,null,null,null,null,null,null,null,"H"]
["Sitework","General",null,null,null,null,null,null,null,null,null,null,null,null,null,null,null,null,null,null,null,null,null,null,null,null,null,null,null,null,null,null,null,null,null,null,null,null,null,null,null,null,null,null,null,null,null,null,null,null,null,null,null,null,null,null,null,null,null,null,null,null,null,null,null,null,null,null,null,null,null,null,null,null,null,null,null,null,null,null,null,null,null,null,null,null,null,null,null,null,null,null,null,null,null,null,null,"H",null,null,null,null,null,null,null,null,null,null,null,null,null,null,null,null,null,null,null,null,null,null,null,null,"H",null,null,null,null,null,null,null,null,null,null,null,null,null,null,null,null,null,null,null,null,null,null,null,null,null,null,null,null,null,null,null,null,null,null,null,null,null,null,null,null,null,null,null,null,null,null,"H",null,null,null,null,null,null,null,null,null,null,null,null,null,null,null,null,null,null,null,null,null,null,null,null,null,null,null,null,null,null,null,null,null,null,null,null,null,null,null,null,null,null,null,null,null,null,null,null,null,null,null,null,null,"H","H","H","H",null,null,null,null,null,null,null,null,null,null,null,null,null,null,null,null,null,null,null,null,"H","H",null,null,null,null,null,null,null,null,null,null,null,null,null,null,null,null,null,null,null,null,null,null,null,null,null,null,null,null,null,null,null,null,null,null,null,null,null,null,null,null,null,null,null,null,null,null,null,null,null,null,null,null,null,null,null,null,null,null,null,null,null,null,null,null,null,null,null,null,null,null,null,null,null,null,null,null,null,null,null,null,null,null,null,null,null,null,null,null,null,null,null,null,null,null,null,null,null,null,null,null,null,null,null,null,null,null,null,null,"H",null,null,null,null,null,null,null,null,null,null,null,null,null,null,null,null,null,null,null,null,null,null,null,null,null,"H",null,null,null,null,null,null,null,null,null,null,null,null,null,null,null,null,null,null,null,null,null,null,null,null,null,null,null,null,null,null,null,null,null,null,null,null,null,null,null,null,null,null,null,null,"H"]
["Sitework","General",null,null,null,null,null,null,null,null,null,null,null,null,null,null,null,null,null,null,null,null,null,null,null,null,null,null,null,null,null,null,null,null,null,null,null,null,null,null,null,null,null,null,null,null,null,null,null,null,null,null,null,null,null,null,null,null,null,null,null,null,null,null,null,null,null,null,null,null,null,null,null,null,null,null,null,null,null,null,null,null,null,null,null,null,null,null,null,null,null,null,null,null,null,null,null,"H",null,null,null,null,null,null,null,null,null,null,null,null,null,null,null,null,null,null,null,null,null,null,null,null,"H",null,null,null,null,null,null,null,null,null,null,null,null,null,null,null,null,null,null,null,null,null,null,null,null,null,null,null,null,null,null,null,null,null,null,null,null,null,null,null,null,null,null,null,null,null,null,"H",null,null,null,null,null,null,null,null,null,null,null,null,null,null,null,null,null,null,null,null,null,null,null,null,null,null,null,null,null,null,null,null,null,null,null,null,null,null,null,null,null,null,null,null,null,null,null,null,null,null,null,null,null,"H","H","H","H",null,null,null,null,null,null,null,null,null,null,null,null,null,null,null,null,null,null,null,null,"H","H",null,null,null,null,null,null,null,null,null,null,null,null,null,null,null,null,null,null,null,null,null,null,null,null,null,null,null,null,null,null,null,null,null,null,null,null,null,null,null,null,null,null,null,null,null,null,null,null,null,null,null,null,null,null,null,null,null,null,null,null,null,null,null,null,null,null,null,null,null,null,null,null,null,null,null,null,null,null,null,null,null,null,null,null,null,null,null,null,null,null,null,null,null,null,null,null,null,null,null,null,null,null,null,null,null,null,null,null,"H",null,null,null,null,null,null,null,null,null,null,null,null,null,null,null,null,null,null,null,null,null,null,null,null,null,"H",null,null,null,null,null,null,null,null,null,null,null,null,null,null,null,null,null,null,null,null,null,null,null,null,null,null,null,null,null,null,null,null,null,null,null,null,null,null,null,null,null,null,null,null,"H"]
["Sitework","General",null,null,null,null,null,null,null,null,null,null,null,null,null,null,null,null,null,null,null,null,null,null,null,null,null,"MOBILIZATION",null,null,null,null,null,null,null,null,null,null,null,null,null,null,null,null,null,null,null,null,null,null,null,null,null,null,null,null,null,null,null,null,null,null,null,null,null,null,null,null,null,null,null,null,null,null,null,null,null,null,null,null,null,null,null,null,null,null,null,null,null,null,null,null,null,null,null,null,null,"H",null,null,null,null,null,null,null,null,null,null,null,null,null,null,null,null,null,null,null,null,null,null,null,null,"H",null,null,null,null,null,null,null,null,null,null,null,null,null,null,null,null,null,null,null,null,null,null,null,null,null,null,null,null,null,null,null,null,null,null,null,null,null,null,null,null,null,null,null,null,null,null,"H",null,null,null,null,null,null,null,null,null,null,null,null,null,null,null,null,null,null,null,null,null,null,null,null,null,null,null,null,null,null,null,null,null,null,null,null,null,null,null,null,null,null,null,null,null,null,null,null,null,null,null,null,null,"H","H","H","H",null,null,null,null,null,null,null,null,null,null,null,null,null,null,null,null,null,null,null,null,"H","H",null,null,null,null,null,null,null,null,null,null,null,null,null,null,null,null,null,null,null,null,null,null,null,null,null,null,null,null,null,null,null,null,null,null,null,null,null,null,null,null,null,null,null,null,null,null,null,null,null,null,null,null,null,null,null,null,null,null,null,null,null,null,null,null,null,null,null,null,null,null,null,null,null,null,null,null,null,null,null,null,null,null,null,null,null,null,null,null,null,null,null,null,null,null,null,null,null,null,null,null,null,null,null,null,null,null,null,null,"H",null,null,null,null,null,null,null,null,null,null,null,null,null,null,null,null,null,null,null,null,null,null,null,null,null,"H",null,null,null,null,null,null,null,null,null,null,null,null,null,null,null,null,null,null,null,null,null,null,null,null,null,null,null,null,null,null,null,null,null,null,null,null,null,null,null,null,null,null,null,null,"H"]
["Sitework","General",null,null,null,null,null,null,null,null,null,null,null,null,null,null,null,null,null,null,null,null,null,null,null,null,null,null,null,null,null,null,"1H","1H","1H","1H","1H","1H","1H","1H","1H","1H","1H","1H","1H","1H","1H","1I","1I","1I","1I","1I","1I","1I","1I","1I","1I","1I","1I","1I","1I","1I","1I","1I","1I","1I","1I","1J","1J","1J","1J","1J","1J","1J","1J","1J","1J","1J","1J","1J","1J","1J","1J","1J","1J","1J","1J","1K","1K","1K","1K","1K","B","B","B","B","B","B",null,null,null,null,null,null,null,null,null,null,null,null,null,null,null,null,null,null,null,null,null,null,null,null,"H",null,null,null,null,null,null,null,null,null,null,null,null,null,null,null,null,null,null,null,null,null,null,null,null,null,null,null,null,null,null,null,null,null,null,null,null,null,null,null,null,null,null,null,null,null,null,"H",null,null,null,null,null,null,null,null,null,null,null,null,null,null,null,null,null,null,null,null,null,null,null,null,null,null,null,null,null,null,null,null,null,null,null,null,null,null,null,null,null,null,null,null,null,null,null,null,null,null,null,null,null,"H","H","H","H",null,null,null,null,null,null,null,null,null,null,null,null,null,null,null,null,null,null,null,null,"H","H",null,null,null,null,null,null,null,null,null,null,null,null,null,null,null,null,null,null,null,null,null,null,null,null,null,null,null,null,null,null,null,null,null,null,null,null,null,null,null,null,null,null,null,null,null,null,null,null,null,null,null,null,null,null,null,null,null,null,null,null,null,null,null,null,null,null,null,null,null,null,null,null,null,null,null,null,null,null,null,null,null,null,null,null,null,null,null,null,null,null,null,null,null,null,null,null,null,null,null,null,null,null,null,null,null,null,null,null,"H",null,null,null,null,null,null,null,null,null,null,null,null,null,null,null,null,null,null,null,null,null,null,null,null,null,"H",null,null,null,null,null,null,null,null,null,null,null,null,null,null,null,null,null,null,null,null,null,null,null,null,null,null,null,null,null,null,null,null,null,null,null,null,null,null,null,null,null,null,null,null,"H"]
["Sitework","General",null,null,null,"BEGINNING SITEWORK WORK",null,null,null,null,null,null,null,null,null,null,null,null,null,null,null,null,null,null,null,null,null,null,null,null,null,null,null,null,null,null,null,null,null,null,null,null,null,null,null,null,null,null,null,null,null,null,null,null,null,null,null,null,null,null,null,null,null,null,null,null,null,null,null,null,null,null,null,null,null,null,null,null,null,null,null,null,null,null,null,null,null,null,null,null,null,null,null,null,null,null,null,"H",null,null,null,null,null,null,null,null,null,null,null,null,null,null,null,null,null,null,null,null,null,null,null,null,"H",null,null,null,null,null,null,null,null,null,null,null,null,null,null,null,null,null,null,null,null,null,null,null,null,null,null,null,null,null,null,null,null,null,null,null,null,null,null,null,null,null,null,null,null,null,null,"H",null,null,null,null,null,null,null,null,null,null,null,null,null,null,null,null,null,null,null,null,null,null,null,null,null,null,null,null,null,null,null,null,null,null,null,null,null,null,null,null,null,null,null,null,null,null,null,null,null,null,null,null,null,"H","H","H","H",null,null,null,null,null,null,null,null,null,null,null,null,null,null,null,null,null,null,null,null,"H","H",null,null,null,null,null,null,null,null,null,null,null,null,null,null,null,null,null,null,null,null,null,null,null,null,null,null,null,null,null,null,null,null,null,null,null,null,null,null,null,null,null,null,null,null,null,null,null,null,null,null,null,null,null,null,null,null,null,null,null,null,null,null,null,null,null,null,null,null,null,null,null,null,null,null,null,null,null,null,null,null,null,null,null,null,null,null,null,null,null,null,null,null,null,null,null,null,null,null,null,null,null,null,null,null,null,null,null,null,"H",null,null,null,null,null,null,null,null,null,null,null,null,null,null,null,null,null,null,null,null,null,null,null,null,null,"H",null,null,null,null,null,null,null,null,null,null,null,null,null,null,null,null,null,null,null,null,null,null,null,null,null,null,null,null,null,null,null,null,null,null,null,null,null,null,null,null,null,null,null,null,"H"]
["Sitework","General",null,null,null,"1H","Excavation/Grading",null,null,null,null,null,null,null,null,null,null,null,null,null,null,null,null,null,null,null,null,null,null,null,null,null,null,null,null,null,null,null,null,null,null,null,null,null,null,null,null,null,null,null,null,null,null,null,null,null,null,null,null,null,null,null,null,null,null,null,null,null,null,null,null,null,null,null,null,null,null,null,null,null,null,null,null,null,null,null,null,null,null,null,null,null,null,null,null,null,null,"H",null,null,null,null,null,null,null,null,null,null,null,null,null,null,null,null,null,null,null,null,null,null,null,null,"H",null,null,null,null,null,null,null,null,null,null,null,null,null,null,null,null,null,null,null,null,null,null,null,null,null,null,null,null,null,null,null,null,null,null,null,null,null,null,null,null,null,null,null,null,null,null,"H",null,null,null,null,null,null,null,null,null,null,null,null,null,null,null,null,null,null,null,null,null,null,null,null,null,null,null,null,null,null,null,null,null,null,null,null,null,null,null,null,null,null,null,null,null,null,null,null,null,null,null,null,null,"H","H","H","H",null,null,null,null,null,null,null,null,null,null,null,null,null,null,null,null,null,null,null,null,"H","H",null,null,null,null,null,null,null,null,null,null,null,null,null,null,null,null,null,null,null,null,null,null,null,null,null,null,null,null,null,null,null,null,null,null,null,null,null,null,null,null,null,null,null,null,null,null,null,null,null,null,null,null,null,null,null,null,null,null,null,null,null,null,null,null,null,null,null,null,null,null,null,null,null,null,null,null,null,null,null,null,null,null,null,null,null,null,null,null,null,null,null,null,null,null,null,null,null,null,null,null,null,null,null,null,null,null,null,null,"H",null,null,null,null,null,null,null,null,null,null,null,null,null,null,null,null,null,null,null,null,null,null,null,null,null,"H",null,null,null,null,null,null,null,null,null,null,null,null,null,null,null,null,null,null,null,null,null,null,null,null,null,null,null,null,null,null,null,null,null,null,null,null,null,null,null,null,null,null,null,null,"H"]
["Foundations","General",null,null,null,"1I","Install Storm/Sanitary/Water/Dry U.G. Utilities",null,null,null,null,null,null,null,null,null,null,null,null,null,null,null,null,null,null,null,null,null,null,null,null,null,null,null,null,null,null,null,null,null,null,null,null,null,null,null,null,null,null,null,null,null,null,null,null,null,null,null,null,null,null,null,null,null,null,null,null,null,null,null,null,null,null,null,null,null,null,null,null,null,null,null,null,null,null,null,null,null,null,null,null,null,null,null,null,null,null,"H",null,null,null,null,null,null,null,null,null,null,null,null,null,null,null,null,null,null,null,null,null,null,null,null,"H",null,null,null,null,null,null,null,null,null,null,null,null,null,null,null,null,null,null,null,null,null,null,null,null,null,null,null,null,null,null,null,null,null,null,null,null,null,null,null,null,null,null,null,null,null,null,"H",null,null,null,null,null,null,null,null,null,null,null,null,null,null,null,null,null,null,null,null,null,null,null,null,null,null,null,null,null,null,null,null,null,null,null,null,null,null,null,null,null,null,null,null,null,null,null,null,null,null,null,null,null,"H","H","H","H",null,null,null,null,null,null,null,null,null,null,null,null,null,null,null,null,null,null,null,null,"H","H",null,null,null,null,null,null,null,null,null,null,null,null,null,null,null,null,null,null,null,null,null,null,null,null,null,null,null,null,null,null,null,null,null,null,null,null,null,null,null,null,null,null,null,null,null,null,null,null,null,null,null,null,null,null,null,null,null,null,null,null,null,null,null,null,null,null,null,null,null,null,null,null,null,null,null,null,null,null,null,null,null,null,null,null,null,null,null,null,null,null,null,null,null,null,null,null,null,null,null,null,null,null,null,null,null,null,null,null,"H",null,null,null,null,null,null,null,null,null,null,null,null,null,null,null,null,null,null,null,null,null,null,null,null,null,"H",null,null,null,null,null,null,null,null,null,null,null,null,null,null,null,null,null,null,null,null,null,null,null,null,null,null,null,null,null,null,null,null,null,null,null,null,null,null,null,null,null,null,null,null,"H"]
["Foundations","Zone A","Zone A",null,null,"1J","Parking Area Base Stone",null,null,null,null,null,null,null,null,null,null,null,null,null,null,null,null,null,null,null,null,null,null,null,null,null,null,null,null,null,null,null,null,null,null,null,null,null,null,null,null,null,null,null,null,null,null,null,null,null,null,null,null,null,null,null,null,null,null,null,null,null,null,null,null,null,null,null,null,null,null,null,null,null,null,null,null,null,null,null,null,null,null,null,null,null,null,null,null,null,"ZONE A","H","F1","F1","F1","F1","F1","F1","F1","F1","F1","F1","F2","F2","F2","F2","F2","F2","F2","F2","F2","F2","F3","F3","F3","F3","H","F3","F3","F3","F3","F3","F3","F4","F4","F4","F4","F4","F4","F4","F4","F4","F4","F4","F4","F4","F4","F4","B","B","B","B","B","B","B","B",null,null,null,null,null,null,null,null,null,null,null,null,null,null,null,null,null,"H",null,null,null,null,null,null,null,null,null,null,null,null,null,null,null,null,null,null,null,null,null,null,null,null,null,null,null,null,null,null,null,null,null,null,null,null,null,null,null,null,null,null,null,null,null,null,null,null,null,null,null,null,null,"H","H","H","H",null,null,null,null,null,null,null,null,null,null,null,null,null,null,null,null,null,null,null,null,"H","H",null,null,null,null,null,null,null,null,null,null,null,null,null,null,null,null,null,null,null,null,null,null,null,null,null,null,null,null,null,null,null,null,null,null,null,null,null,null,null,null,null,null,null,null,null,null,null,null,null,null,null,null,null,null,null,null,null,null,null,null,null,null,null,null,null,null,null,null,null,null,null,null,null,null,null,null,null,null,null,null,null,null,null,null,null,null,null,null,null,null,null,null,null,null,null,null,null,null,null,null,null,null,null,null,null,null,null,null,"H",null,null,null,null,null,null,null,null,null,null,null,null,null,null,null,null,null,null,null,null,null,null,null,null,null,"H",null,null,null,null,null,null,null,null,null,null,null,null,null,null,null,null,null,null,null,null,null,null,null,null,null,null,null,null,null,null,null,null,null,null,null,null,null,null,null,null,null,null,null,null,"H"]
["Foundations","General","General",null,null,"1K","Final Grading",null,null,null,null,null,null,null,null,null,null,null,null,null,null,null,null,null,null,null,null,null,null,null,null,null,null,null,null,null,null,null,null,null,null,null,null,null,null,null,null,null,null,null,null,null,null,null,null,null,null,null,null,null,null,null,null,null,null,null,null,null,null,null,null,null,null,null,null,null,null,null,null,null,null,null,null,null,null,null,null,null,null,null,null,null,null,null,null,null,null,"H",null,null,null,null,null,null,null,null,null,"ZONE B","F1","F1","F1","F1","F1","F1","F1","F1","F1","F1","F2","F2","F2","F2","H","F2","F2","F2","F2","F2","F2","F3","F3","F3","F3","F3","F3","F3","F3","F3","F3","F4","F4","F4","F4","F4","F4","F4","F4","F4","F4","F4","F4","F4","F4","F4",null,null,null,null,null,null,null,null,null,null,null,null,null,null,null,"H",null,null,null,null,null,null,null,null,null,null,null,null,null,null,null,null,null,null,null,null,null,null,null,null,null,null,null,null,null,null,null,null,null,null,null,null,null,null,null,null,null,null,null,null,null,null,null,null,null,null,null,null,null,"H","H","H","H",null,null,null,null,null,null,null,null,null,null,null,null,null,null,null,null,null,null,null,null,"H","H",null,null,null,null,null,null,null,null,null,null,null,null,null,null,null,null,null,null,null,null,null,null,null,null,null,null,null,null,null,null,null,null,null,null,null,null,null,null,null,null,null,null,null,null,null,null,null,null,null,null,null,null,null,null,null,null,null,null,null,null,null,null,null,null,null,null,null,null,null,null,null,null,null,null,null,null,null,null,null,null,null,null,null,null,null,null,null,null,null,null,null,null,null,null,null,null,null,null,null,null,null,null,null,null,null,null,null,null,"H",null,null,null,null,null,null,null,null,null,null,null,null,null,null,null,null,null,null,null,null,null,null,null,null,null,"H",null,null,null,null,null,null,null,null,null,null,null,null,null,null,null,null,null,null,null,null,null,null,null,null,null,null,null,null,null,null,null,null,null,null,null,null,null,null,null,null,null,null,null,null,"H"]
["Foundations","General","General",null,null,null,null,null,null,null,null,null,null,null,null,null,null,null,null,null,null,null,null,null,null,null,null,null,null,null,null,null,null,null,null,null,null,null,null,null,null,null,null,null,null,null,null,null,null,null,null,null,null,null,null,null,null,null,null,null,null,null,null,null,null,null,null,null,null,null,null,null,null,null,null,null,null,null,null,null,null,null,null,null,null,null,null,null,null,null,null,null,null,null,null,null,null,"H",null,null,null,null,null,null,null,null,null,null,null,null,null,null,null,null,null,null,null,null,null,null,null,null,"H",null,null,null,null,null,null,null,null,null,null,null,null,null,null,null,null,null,null,null,null,null,null,null,null,null,null,null,null,null,null,null,null,null,null,null,null,null,null,null,null,null,null,null,null,null,null,"H",null,null,null,null,null,null,null,null,null,null,null,null,null,null,null,null,null,null,null,null,null,null,null,null,null,null,null,null,null,null,null,null,null,null,null,null,null,null,null,null,null,null,null,null,null,null,null,null,null,null,null,null,null,"H","H","H","H",null,null,null,null,null,null,null,null,null,null,null,null,null,null,null,null,null,null,null,null,"H","H",null,null,null,null,null,null,null,null,null,null,null,null,null,null,null,null,null,null,null,null,null,null,null,null,null,null,null,null,null,null,null,null,null,null,null,null,null,null,null,null,null,null,null,null,null,null,null,null,null,null,null,null,null,null,null,null,null,null,null,null,null,null,null,null,null,null,null,null,null,null,null,null,null,null,null,null,null,null,null,null,null,null,null,null,null,null,null,null,null,null,null,null,null,null,null,null,null,null,null,null,null,null,null,null,null,null,null,null,"H",null,null,null,null,null,null,null,null,null,null,null,null,null,null,null,null,null,null,null,null,null,null,null,null,null,"H",null,null,null,null,null,null,null,null,null,null,null,null,null,null,null,null,null,null,null,null,null,null,null,null,null,null,null,null,null,null,null,null,null,null,null,null,null,null,null,null,null,null,null,null,"H"]
["Structure","General","General",null,null,null,null,null,null,null,null,null,null,null,null,null,null,null,null,null,null,null,null,null,null,null,null,null,null,null,null,null,null,null,null,null,null,null,null,null,null,null,null,null,null,null,null,null,null,null,null,null,null,null,null,null,null,null,null,null,null,null,null,null,null,null,null,null,null,null,null,null,null,null,null,null,null,null,null,null,null,null,null,null,null,null,null,null,null,null,null,null,null,null,null,null,null,"H",null,null,null,null,null,null,null,null,null,null,null,null,null,null,null,null,null,null,null,null,null,null,null,null,"H",null,null,null,null,null,null,null,null,null,null,null,null,null,null,null,null,null,null,null,null,null,null,null,null,null,null,null,null,null,null,null,null,null,null,null,null,null,null,null,null,null,null,null,null,null,null,"H",null,null,null,null,null,null,null,null,null,null,null,null,null,null,null,null,null,null,null,null,null,null,null,null,null,null,null,null,null,null,null,null,null,null,null,null,null,null,null,null,null,null,null,null,null,null,null,null,null,null,null,null,null,"H","H","H","H",null,null,null,null,null,null,null,null,null,null,null,null,null,null,null,null,null,null,null,null,"H","H",null,null,null,null,null,null,null,null,null,null,null,null,null,null,null,null,null,null,null,null,null,null,null,null,null,null,null,null,null,null,null,null,null,null,null,null,null,null,null,null,null,null,null,null,null,null,null,null,null,null,null,null,null,null,null,null,null,null,null,null,null,null,null,null,null,null,null,null,null,null,null,null,null,null,null,null,null,null,null,null,null,null,null,null,null,null,null,null,null,null,null,null,null,null,null,null,null,null,null,null,null,null,null,null,null,null,null,null,"H",null,null,null,null,null,null,null,null,null,null,null,null,null,null,null,null,null,null,null,null,null,null,null,null,null,"H",null,null,null,null,null,null,null,null,null,null,null,null,null,null,null,null,null,null,null,null,null,null,null,null,null,null,null,null,null,null,null,null,null,null,null,null,null,null,null,null,null,null,null,null,"H"]
["Structure","General","General",null,null,null,null,null,null,null,null,null,null,null,null,null,null,null,null,null,null,null,null,null,null,null,null,null,null,null,null,null,null,null,null,null,null,null,null,null,null,null,null,null,null,null,null,null,null,null,null,null,null,null,null,null,null,null,null,null,null,null,null,null,null,null,null,null,null,null,null,null,null,null,null,null,null,null,null,null,null,null,null,null,null,null,null,null,null,null,null,null,null,null,null,null,null,"H",null,null,null,null,null,null,null,null,null,null,null,null,null,null,null,null,null,null,null,null,null,null,null,null,"H",null,null,null,null,null,null,null,null,null,null,null,null,null,null,null,null,null,null,null,null,null,null,null,null,null,null,null,null,null,null,null,null,null,null,null,null,null,null,null,null,null,null,null,null,null,null,"H",null,null,null,null,null,null,null,null,null,null,null,null,null,null,null,null,null,null,null,null,null,null,null,null,null,null,null,null,null,null,null,null,null,null,null,null,null,null,null,null,null,null,null,null,null,null,null,null,null,null,null,null,null,"H","H","H","H",null,null,null,null,null,null,null,null,null,null,null,null,null,null,null,null,null,null,null,null,"H","H",null,null,null,null,null,null,null,null,null,null,null,null,null,null,null,null,null,null,null,null,null,null,null,null,null,null,null,null,null,null,null,null,null,null,null,null,null,null,null,null,null,null,null,null,null,null,null,null,null,null,null,null,null,null,null,null,null,null,null,null,null,null,null,null,null,null,null,null,null,null,null,null,null,null,null,null,null,null,null,null,null,null,null,null,null,null,null,null,null,null,null,null,null,null,null,null,null,null,null,null,null,null,null,null,null,null,null,null,"H",null,null,null,null,null,null,null,null,null,null,null,null,null,null,null,null,null,null,null,null,null,null,null,null,null,"H",null,null,null,null,null,null,null,null,null,null,null,null,null,null,null,null,null,null,null,null,null,null,null,null,null,null,null,null,null,null,null,null,null,null,null,null,null,null,null,null,null,null,null,null,"H"]
["Structure","Zone 1A",null,null,null,null,null,null,null,null,null,null,null,null,null,null,null,null,null,null,null,null,null,null,null,null,null,null,null,null,null,null,null,null,null,null,null,null,null,null,null,null,null,null,null,null,null,null,null,null,null,null,null,null,null,null,null,null,null,null,null,null,null,null,null,null,null,null,null,null,null,null,null,null,null,null,null,null,null,null,null,null,null,null,null,null,null,null,null,null,null,null,null,null,null,null,null,"H",null,null,null,null,null,null,null,null,null,null,null,null,null,null,null,null,null,null,null,null,null,null,null,null,"H",null,null,null,null,null,null,null,null,null,null,null,null,null,null,null,null,null,null,null,null,null,null,null,null,null,null,null,null,"LEVEL 1A","S1","S1","S1","S1","S1","S1","S1","S1","S1","S1","S1","S1","S2","S2","S2","S2","S2","H","S2","S2","S2","S2","S2","S2","S2","S3","S3","S3","S3","S3","S3","S4","S4","S4","S4","S4","S4","S4","S4","S4",null,null,null,null,null,null,null,null,null,null,null,null,null,null,null,null,null,null,null,null,null,null,null,null,null,null,null,null,null,null,null,"H","H","H","H",null,null,null,null,null,null,null,null,null,null,null,null,null,null,null,null,null,null,null,null,"H","H",null,null,null,null,null,null,null,null,null,null,null,null,null,null,null,null,null,null,null,null,null,null,null,null,null,null,null,null,null,null,null,null,null,null,null,null,null,null,null,null,null,null,null,null,null,null,null,null,null,null,null,null,null,null,null,null,null,null,null,null,null,null,null,null,null,null,null,null,null,null,null,null,null,null,null,null,null,null,null,null,null,null,null,null,null,null,null,null,null,null,null,null,null,null,null,null,null,null,null,null,null,null,null,null,null,null,null,null,"H",null,null,null,null,null,null,null,null,null,null,null,null,null,null,null,null,null,null,null,null,null,null,null,null,null,"H",null,null,null,null,null,null,null,null,null,null,null,null,null,null,null,null,null,null,null,null,null,null,null,null,null,null,null,null,null,null,null,null,null,null,null,null,null,null,null,null,null,null,null,null,"H"]
["Structure","Zone 1B",null,null,null,"FOUNDATION LEGEND",null,null,null,null,null,null,null,null,null,null,null,null,null,null,null,null,null,null,null,null,null,null,null,null,null,null,null,null,null,null,null,null,null,null,null,null,null,null,null,null,null,null,null,null,null,null,null,null,null,null,null,null,null,null,null,null,null,null,null,null,null,null,null,null,null,null,null,null,null,null,null,null,null,null,null,null,null,null,null,null,null,null,null,null,null,null,null,null,null,null,null,"H",null,null,null,null,null,null,null,null,null,null,null,null,null,null,null,null,null,null,null,null,null,null,null,null,"H",null,null,null,null,null,null,null,null,null,null,null,null,null,null,null,null,null,null,null,null,null,null,null,null,null,null,null,null,null,null,null,"LEVEL 1B","S1","S1","S1","S1","S1","S1","S1","S1","S1","S1","S1","S1","S2","S2","H","S2","S2","S2","S2","S2","S2","S2","S2","S2","S2","S3","S3","S3","S3","S3","S3","S4","S4","S4","S4","S4","S4","S4","S4","S4",null,null,null,null,null,null,null,null,null,null,null,null,null,null,null,null,null,null,null,null,null,null,null,null,null,null,null,null,"H","H","H","H",null,null,null,null,null,null,null,null,null,null,null,null,null,null,null,null,null,null,null,null,"H","H",null,null,null,null,null,null,null,null,null,null,null,null,null,null,null,null,null,null,null,null,null,null,null,null,null,null,null,null,null,null,null,null,null,null,null,null,null,null,null,null,null,null,null,null,null,null,null,null,null,null,null,null,null,null,null,null,null,null,null,null,null,null,null,null,null,null,null,null,null,null,null,null,null,null,null,null,null,null,null,null,null,null,null,null,null,null,null,null,null,null,null,null,null,null,null,null,null,null,null,null,null,null,null,null,null,null,null,null,"H",null,null,null,null,null,null,null,null,null,null,null,null,null,null,null,null,null,null,null,null,null,null,null,null,null,"H",null,null,null,null,null,null,null,null,null,null,null,null,null,null,null,null,null,null,null,null,null,null,null,null,null,null,null,null,null,null,null,null,null,null,null,null,null,null,null,null,null,null,null,null,"H"]
["Structure","Zone 2A",null,null,null,"F1","Excavate & Pour Footings",null,null,null,null,null,null,null,null,null,null,null,null,null,null,null,null,null,null,null,null,null,null,null,null,null,null,null,null,null,null,null,null,null,null,null,null,null,null,null,null,null,null,null,null,null,null,null,null,null,null,null,null,null,null,null,null,null,null,null,null,null,null,null,null,null,null,null,null,null,null,null,null,null,null,null,null,null,null,null,null,null,null,null,null,null,null,null,null,null,null,"H",null,null,null,null,null,null,null,null,null,null,null,null,null,null,null,null,null,null,null,null,null,null,null,null,"H",null,null,null,null,null,null,null,null,null,null,null,null,null,null,null,null,null,null,null,null,null,null,null,null,null,null,null,null,null,null,null,null,null,null,"LEVEL 2A","S1","S1","S1","S1","S1","S1","S1","S1","S1","S1","S1","H","S1","S2","S2","S2","S2","S2","S2","S2","S2","S2","S2","S2","S2","S3","S3","S3","S3","S3","S3","S4","S4","S4","S4","S4","S4","S4","S4","S4",null,null,null,null,null,null,null,null,null,null,null,null,null,null,null,null,null,null,null,null,null,null,null,null,null,"H","H","H","H",null,null,null,null,null,null,null,null,null,null,null,null,null,null,null,null,null,null,null,null,"H","H",null,null,null,null,null,null,null,null,null,null,null,null,null,null,null,null,null,null,null,null,null,null,null,null,null,null,null,null,null,null,null,null,null,null,null,null,null,null,null,null,null,null,null,null,null,null,null,null,null,null,null,null,null,null,null,null,null,null,null,null,null,null,null,null,null,null,null,null,null,null,null,null,null,null,null,null,null,null,null,null,null,null,null,null,null,null,null,null,null,null,null,null,null,null,null,null,null,null,null,null,null,null,null,null,null,null,null,null,"H",null,null,null,null,null,null,null,null,null,null,null,null,null,null,null,null,null,null,null,null,null,null,null,null,null,"H",null,null,null,null,null,null,null,null,null,null,null,null,null,null,null,null,null,null,null,null,null,null,null,null,null,null,null,null,null,null,null,null,null,null,null,null,null,null,null,null,null,null,null,null,"H"]
["Structure","Zone 2C",null,null,null,"F2","Columns & Walls",null,null,null,null,null,null,null,null,null,null,null,null,null,null,null,null,null,null,null,null,null,null,null,null,null,null,null,null,null,null,null,null,null,null,null,null,null,null,null,null,null,null,null,null,null,null,null,null,null,null,null,null,null,null,null,null,null,null,null,null,null,null,null,null,null,null,null,null,null,null,null,null,null,null,null,null,null,null,null,null,null,null,null,null,null,null,null,null,null,null,"H",null,null,null,null,null,null,null,null,null,null,null,null,null,null,null,null,null,null,null,null,null,null,null,null,"H",null,null,null,null,null,null,null,null,null,null,null,null,null,null,null,null,null,null,null,null,null,null,null,null,null,null,null,null,null,null,null,null,null,null,null,null,null,"LEVEL 2B","S1","S1","S1","S1","S1","S1","S1","S1","H","S1","S1","S1","S1","S2","S2","S2","S2","S2","S2","S2","S2","S2","S2","S2","S2","S3","S3","S3","S3","S3","S3","S4","S4","S4","S4","S4","S4","S4","S4","S4",null,null,null,null,null,null,null,null,null,null,null,null,null,null,null,null,null,null,null,null,null,null,"H","H","H","H",null,null,null,null,null,null,null,null,null,null,null,null,null,null,null,null,null,null,null,null,"H","H",null,null,null,null,null,null,null,null,null,null,null,null,null,null,null,null,null,null,null,null,null,null,null,null,null,null,null,null,null,null,null,null,null,null,null,null,null,null,null,null,null,null,null,null,null,null,null,null,null,null,null,null,null,null,null,null,null,null,null,null,null,null,null,null,null,null,null,null,null,null,null,null,null,null,null,null,null,null,null,null,null,null,null,null,null,null,null,null,null,null,null,null,null,null,null,null,null,null,null,null,null,null,null,null,null,null,null,null,"H",null,null,null,null,null,null,null,null,null,null,null,null,null,null,null,null,null,null,null,null,null,null,null,null,null,"H",null,null,null,null,null,null,null,null,null,null,null,null,null,null,null,null,null,null,null,null,null,null,null,null,null,null,null,null,null,null,null,null,null,null,null,null,null,null,null,null,null,null,null,null,"H"]
["Structure","Zone 3A",null,null,null,"F3","UG MEP",null,null,null,null,null,null,null,null,null,null,null,null,null,null,null,null,null,null,null,null,null,null,null,null,null,null,null,null,null,null,null,null,null,null,null,null,null,null,null,null,null,null,null,null,null,null,null,null,null,null,null,null,null,null,null,null,null,null,null,null,null,null,null,null,null,null,null,null,null,null,null,null,null,null,null,null,null,null,null,null,null,null,null,null,null,null,null,null,null,null,"H",null,null,null,null,null,null,null,null,null,null,null,null,null,null,null,null,null,null,null,null,null,null,null,null,"H",null,null,null,null,null,null,null,null,null,null,null,null,null,null,null,null,null,null,null,null,null,null,null,null,null,null,null,null,null,null,null,null,null,null,null,null,null,null,null,null,"LEVEL 3A","S1","S1","S1","S1","S1","H","S1","S1","S1","S1","S1","S1","S1","S2","S2","S2","S2","S2","S2","S2","S2","S2","S2","S2","S2","S3","S3","S3","S3","S3","S3","S4","S4","S4","S4","S4","S4","S4","S4","S4",null,null,null,null,null,null,null,null,null,null,null,null,null,null,null,null,null,null,null,"H","H","H","H",null,null,null,null,null,null,null,null,null,null,null,null,null,null,null,null,null,null,null,null,"H","H",null,null,null,null,null,null,null,null,null,null,null,null,null,null,null,null,null,null,null,null,null,null,null,null,null,null,null,null,null,null,null,null,null,null,null,null,null,null,null,null,null,null,null,null,null,null,null,null,null,null,null,null,null,null,null,null,null,null,null,null,null,null,null,null,null,null,null,null,null,null,null,null,null,null,null,null,null,null,null,null,null,null,null,null,null,null,null,null,null,null,null,null,null,null,null,null,null,null,null,null,null,null,null,null,null,null,null,null,"H",null,null,null,null,null,null,null,null,null,null,null,null,null,null,null,null,null,null,null,null,null,null,null,null,null,"H",null,null,null,null,null,null,null,null,null,null,null,null,null,null,null,null,null,null,null,null,null,null,null,null,null,null,null,null,null,null,null,null,null,null,null,null,null,null,null,null,null,null,null,null,"H"]
["Structure","Zone 3B",null,null,null,"F4","SOG",null,null,null,null,null,null,null,null,null,null,null,null,null,null,null,null,null,null,null,null,null,null,null,null,null,null,null,null,null,null,null,null,null,null,null,null,null,null,null,null,null,null,null,null,null,null,null,null,null,null,null,null,null,null,null,null,null,null,null,null,null,null,null,null,null,null,null,null,null,null,null,null,null,null,null,null,null,null,null,null,null,null,null,null,null,null,null,null,null,null,"H",null,null,null,null,null,null,null,null,null,null,null,null,null,null,null,null,null,null,null,null,null,null,null,null,"H",null,null,null,null,null,null,null,null,null,null,null,null,null,null,null,null,null,null,null,null,null,null,null,null,null,null,null,null,null,null,null,null,null,null,null,null,null,null,null,null,null,null,null,"LEVEL 3B","S1","S1","H","S1","S1","S1","S1","S1","S1","S1","S1","S1","S1","S2","S2","S2","S2","S2","S2","S2","S2","S2","S2","S2","S2","S3","S3","S3","S3","S3","S3","S4","S4","S4","S4","S4","S4","S4","S4","S4",null,null,null,null,null,null,null,null,null,null,null,null,null,null,null,null,"H","H","H","H",null,null,null,null,null,null,null,null,null,null,null,null,null,null,null,null,null,null,null,null,"H","H",null,null,null,null,null,null,null,null,null,null,null,null,null,null,null,null,null,null,null,null,null,null,null,null,null,null,null,null,null,null,null,null,null,null,null,null,null,null,null,null,null,null,null,null,null,null,null,null,null,null,null,null,null,null,null,null,null,null,null,null,null,null,null,null,null,null,null,null,null,null,null,null,null,null,null,null,null,null,null,null,null,null,null,null,null,null,null,null,null,null,null,null,null,null,null,null,null,null,null,null,null,null,null,null,null,null,null,null,"H",null,null,null,null,null,null,null,null,null,null,null,null,null,null,null,null,null,null,null,null,null,null,null,null,null,"H",null,null,null,null,null,null,null,null,null,null,null,null,null,null,null,null,null,null,null,null,null,null,null,null,null,null,null,null,null,null,null,null,null,null,null,null,null,null,null,null,null,null,null,null,"H"]
["Structure","Zone 4A",null,null,null,"B","Buffer",null,null,null,null,null,null,null,null,null,null,null,null,null,null,null,null,null,null,null,null,null,null,null,null,null,null,null,null,null,null,null,null,null,null,null,null,null,null,null,null,null,null,null,null,null,null,null,null,null,null,null,null,null,null,null,null,null,null,null,null,null,null,null,null,null,null,null,null,null,null,null,null,null,null,null,null,null,null,null,null,null,null,null,null,null,null,null,null,null,null,"H",null,null,null,null,null,null,null,null,null,null,null,null,null,null,null,null,null,null,null,null,null,null,null,null,"H",null,null,null,null,null,null,null,null,null,null,null,null,null,null,null,null,null,null,null,null,null,null,null,null,null,null,null,null,null,null,null,null,null,null,null,null,null,null,null,null,null,null,null,null,null,null,null,"LEVEL 4A","S1","S1","S1","S1","S1","S1","S1","S1","S1","S1","S1","S1","S2","S2","S2","S2","S2","S2","S2","S2","S2","S2","S2","S2","S3","S3","S3","S3","S3","S3","S4","S4","S4","S4","S4","S4","S4","S4","S4",null,null,null,null,null,null,null,null,null,null,null,null,null,"H","H","H","H",null,null,null,null,null,null,null,null,null,null,null,null,null,null,null,null,null,null,null,null,"H","H",null,null,null,null,null,null,null,null,null,null,null,null,null,null,null,null,null,null,null,null,null,null,null,null,null,null,null,null,null,null,null,null,null,null,null,null,null,null,null,null,null,null,null,null,null,null,null,null,null,null,null,null,null,null,null,null,null,null,null,null,null,null,null,null,null,null,null,null,null,null,null,null,null,null,null,null,null,null,null,null,null,null,null,null,null,null,null,null,null,null,null,null,null,null,null,null,null,null,null,null,null,null,null,null,null,null,null,null,"H",null,null,null,null,null,null,null,null,null,null,null,null,null,null,null,null,null,null,null,null,null,null,null,null,null,"H",null,null,null,null,null,null,null,null,null,null,null,null,null,null,null,null,null,null,null,null,null,null,null,null,null,null,null,null,null,null,null,null,null,null,null,null,null,null,null,null,null,null,null,null,"H"]
["Structure","Zone 4B",null,null,null,null,null,null,null,null,null,null,null,null,null,null,null,null,null,null,null,null,null,null,null,null,null,null,null,null,null,null,null,null,null,null,null,null,null,null,null,null,null,null,null,null,null,null,null,null,null,null,null,null,null,null,null,null,null,null,null,null,null,null,null,null,null,null,null,null,null,null,null,null,null,null,null,null,null,null,null,null,null,null,null,null,null,null,null,null,null,null,null,null,null,null,null,"H",null,null,null,null,null,null,null,null,null,null,null,null,null,null,null,null,null,null,null,null,null,null,null,null,"H",null,null,null,null,null,null,null,null,null,null,null,null,null,null,null,null,null,null,null,null,null,null,null,null,null,null,null,null,null,null,null,null,null,null,null,null,null,null,null,null,null,null,null,null,null,null,"H",null,null,null,"LEVEL 4B","S1","S1","S1","S1","S1","S1","S1","S1","S1","S1","S1","S1","S2","S2","S2","S2","S2","S2","S2","S2","S2","S2","S2","S2","S3","S3","S3","S3","S3","S3","S4","S4","S4","S4","S4","S4","S4","S4","S4",null,null,null,null,null,null,null,null,null,null,"H","H","H","H",null,null,null,null,null,null,null,null,null,null,null,null,null,null,null,null,null,null,null,null,"H","H",null,null,null,null,null,null,null,null,null,null,null,null,null,null,null,null,null,null,null,null,null,null,null,null,null,null,null,null,null,null,null,null,null,null,null,null,null,null,null,null,null,null,null,null,null,null,null,null,null,null,null,null,null,null,null,null,null,null,null,null,null,null,null,null,null,null,null,null,null,null,null,null,null,null,null,null,null,null,null,null,null,null,null,null,null,null,null,null,null,null,null,null,null,null,null,null,null,null,null,null,null,null,null,null,null,null,null,null,"H",null,null,null,null,null,null,null,null,null,null,null,null,null,null,null,null,null,null,null,null,null,null,null,null,null,"H",null,null,null,null,null,null,null,null,null,null,null,null,null,null,null,null,null,null,null,null,null,null,null,null,null,null,null,null,null,null,null,null,null,null,null,null,null,null,null,null,null,null,null,null,"H"]
["Structure","Zone 5A",null,null,null,null,null,null,null,null,null,null,null,null,null,null,null,null,null,null,null,null,null,null,null,null,null,null,null,null,null,null,null,null,null,null,null,null,null,null,null,null,null,null,null,null,null,null,null,null,null,null,null,null,null,null,null,null,null,null,null,null,null,null,null,null,null,null,null,null,null,null,null,null,null,null,null,null,null,null,null,null,null,null,null,null,null,null,null,null,null,null,null,null,null,null,null,"H",null,null,null,null,null,null,null,null,null,null,null,null,null,null,null,null,null,null,null,null,null,null,null,null,"H",null,null,null,null,null,null,null,null,null,null,null,null,null,null,null,null,null,null,null,null,null,null,null,null,null,null,null,null,null,null,null,null,null,null,null,null,null,null,null,null,null,null,null,null,null,null,"H",null,null,null,null,null,null,"LEVEL 5A","S1","S1","S1","S1","S1","S1","S1","S1","S1","S1","S1","S1","S2","S2","S2","S2","S2","S2","S2","S2","S2","S2","S2","S2","S3","S3","S3","S3","S3","S3","S4","S4","S4","S4","S4","S4","S4","S4","S4",null,null,null,null,null,null,null,"H","H","H","H",null,null,null,null,null,null,null,null,null,null,null,null,null,null,null,null,null,null,null,null,"H","H",null,null,null,null,null,null,null,null,null,null,null,null,null,null,null,null,null,null,null,null,null,null,null,null,null,null,null,null,null,null,null,null,null,null,null,null,null,null,null,null,null,null,null,null,null,null,null,null,null,null,null,null,null,null,null,null,null,null,null,null,null,null,null,null,null,null,null,null,null,null,null,null,null,null,null,null,null,null,null,null,null,null,null,null,null,null,null,null,null,null,null,null,null,null,null,null,null,null,null,null,null,null,null,null,null,null,null,null,"H",null,null,null,null,null,null,null,null,null,null,null,null,null,null,null,null,null,null,null,null,null,null,null,null,null,"H",null,null,null,null,null,null,null,null,null,null,null,null,null,null,null,null,null,null,null,null,null,null,null,null,null,null,null,null,null,null,null,null,null,null,null,null,null,"Substantial Completion",null,null,null,null,null,null,"H",null,null,null,null,null,null,null,null,null,null,null,null,"Final Completion + Financial Completion"]
["Structure","Zone 5B",null,null,null,null,null,null,null,null,null,null,null,null,null,null,null,null,null,null,null,null,null,null,null,null,null,null,null,null,null,null,null,null,null,null,null,null,null,null,null,null,null,null,null,null,null,null,null,null,null,null,null,null,null,null,null,null,null,null,null,null,null,null,null,null,null,null,null,null,null,null,null,null,null,null,null,null,null,null,null,null,null,null,null,null,null,null,null,null,null,null,null,null,null,null,null,"H",null,null,null,null,null,null,null,null,null,null,null,null,null,null,null,null,null,null,null,null,null,null,null,null,"H",null,null,null,null,null,null,null,null,null,null,null,null,null,null,null,null,null,null,null,null,null,null,null,null,null,null,null,null,null,null,null,null,null,null,null,null,null,null,null,null,null,null,null,null,null,null,"H",null,null,null,null,null,null,null,null,null,"LEVEL 5B","S1","S1","S1","S1","S1","S1","S1","S1","S1","S1","S1","S1","S2","S2","S2","S2","S2","S2","S2","S2","S2","S2","S2","S2","S3","S3","S3","S3","S3","S3","S4","S4","S4","S4","S4","S4","S4","S4","S4","B","B","B","B","B","B","B","B","B","B","B","B","B","B","B","B","B","B","B","B","B","B","B","B","B","B","B",null,"H","H",null,null,null,null,null,null,null,null,null,null,null,null,null,null,null,null,null,null,null,null,null,null,null,null,null,null,null,null,null,null,null,null,null,null,null,null,null,null,null,null,null,null,null,null,null,null,null,null,null,null,null,null,null,null,null,null,null,null,null,null,null,null,null,null,null,null,null,null,null,null,null,null,null,null,null,null,null,null,null,null,null,null,null,null,null,null,null,null,null,null,null,null,null,null,null,null,null,null,null,null,null,null,null,null,null,null,null,null,"H",null,null,null,null,null,null,null,null,null,null,null,null,null,null,null,null,null,null,null,null,null,null,null,null,null,"H",null,null,null,null,null,null,null,null,null,null,null,null,null,null,null,null,null,null,null,null,null,null,null,null,null,null,null,null,null,null,null,null,null,null,null,null,null,null,null,null,null,null,null,null,"H"]
["Interior","Stairs","Stairs",null,null,null,null,null,null,null,null,null,null,null,null,null,null,null,null,null,null,null,null,null,null,null,null,null,null,null,null,null,null,null,null,null,null,null,null,null,null,null,null,null,null,null,null,null,null,null,null,null,null,null,null,null,null,null,null,null,null,null,null,null,null,null,null,null,null,null,null,null,null,null,null,null,null,null,null,null,null,null,null,null,null,null,null,null,null,null,null,null,null,null,null,null,null,"H",null,null,null,null,null,null,null,null,null,null,null,null,null,null,null,null,null,null,null,null,null,null,null,null,"H",null,null,null,null,null,null,null,null,null,null,null,null,null,null,null,null,null,null,null,null,null,null,null,null,null,null,null,null,null,null,null,null,null,null,null,null,null,null,null,null,null,null,null,null,null,null,"H",null,null,null,null,null,null,null,null,null,null,null,null,null,null,null,null,null,null,null,null,null,null,null,null,null,null,null,null,null,null,null,null,null,null,null,null,null,null,null,null,null,null,null,null,null,null,null,null,null,null,null,null,null,"H","H","H","H",null,null,null,null,"STAIR 1","S5","S5","S5","S5","S5","S5","S5","S5","S5","S5","S5","S5","S5","S5","S5","H","H","S5","S5","S5","S5","S5","C","C","C","C","C","C","C","C","C","C","C","C","C","C","C",null,null,null,null,null,null,null,null,null,null,null,null,null,null,null,null,null,null,null,null,null,null,null,null,null,null,null,null,null,null,null,null,null,null,null,null,null,null,null,null,null,null,null,null,null,null,null,null,null,null,null,null,null,null,null,null,null,null,null,null,null,null,null,null,null,null,null,null,null,null,null,null,null,null,null,null,null,null,null,null,null,null,null,null,null,null,null,null,"H",null,null,null,null,null,null,null,null,null,null,null,null,null,null,null,null,null,null,null,null,null,null,null,null,null,"H",null,null,null,null,null,null,null,null,null,null,null,null,null,null,null,null,null,null,null,null,null,null,null,null,null,null,null,null,null,null,null,null,null,null,null,null,null,null,null,null,null,null,null,null,"H"]
["Interior","Stairs","Stairs",null,null,"STRUCTURE LEGEND",null,null,null,null,null,null,null,null,null,null,null,null,null,null,null,null,null,null,null,null,null,null,null,null,null,null,null,null,null,null,null,null,null,null,null,null,null,null,null,null,null,null,null,null,null,null,null,null,null,null,null,null,null,null,null,null,null,null,null,null,null,null,null,null,null,null,null,null,null,null,null,null,null,null,null,null,null,null,null,null,null,null,null,null,null,null,null,null,null,null,null,"H",null,null,null,null,null,null,null,null,null,null,null,null,null,null,null,null,null,null,null,null,null,null,null,null,"H",null,null,null,null,null,null,null,null,null,null,null,null,null,null,null,null,null,null,null,null,null,null,null,null,null,null,null,null,null,null,null,null,null,null,null,null,null,null,null,null,null,null,null,null,null,null,"H",null,null,null,null,null,null,null,null,null,null,null,null,null,null,null,null,null,null,null,null,null,null,null,null,null,null,null,null,null,null,null,null,null,null,null,null,null,null,null,null,null,null,null,null,null,null,null,null,null,null,null,null,null,"H","H","H","H",null,null,null,null,null,null,null,null,null,null,null,null,null,null,null,null,null,null,null,null,"H","H",null,null,null,null,"STAIR 2","S5","S5","S5","S5","S5","S5","S5","S5","S5","S5","S5","S5","S5","S5","S5","S5","S5","S5","S5","S5","C","C","C","C","C","C","C","C","C","C","C","C","C","C","C",null,null,null,null,null,null,null,null,null,null,null,null,null,null,null,null,null,null,null,null,null,null,null,null,null,null,null,null,null,null,null,null,null,null,null,null,null,null,null,null,null,null,null,null,null,null,null,null,null,null,null,null,null,null,null,null,null,null,null,null,null,null,null,null,null,null,null,null,"H",null,null,null,null,null,null,null,null,null,null,null,null,null,null,null,null,null,null,null,null,null,null,null,null,null,"H",null,null,null,null,null,null,null,null,null,null,null,null,null,null,null,null,null,null,null,null,null,null,null,null,null,null,null,null,null,null,null,null,null,null,null,null,null,null,null,null,null,null,null,null,"H"]
["Interior","Elevator","Elevator",null,null,"S1","Deck Formwork",null,null,null,null,null,null,null,null,null,null,null,null,null,null,null,null,null,null,null,null,null,null,null,null,null,null,null,null,null,null,null,null,null,null,null,null,null,null,null,null,null,null,null,null,null,null,null,null,null,null,null,null,null,null,null,null,null,null,null,null,null,null,null,null,null,null,null,null,null,null,null,null,null,null,null,null,null,null,null,null,null,null,null,null,null,null,null,null,null,null,"H",null,null,null,null,null,null,null,null,null,null,null,null,null,null,null,null,null,null,null,null,null,null,null,null,"H",null,null,null,null,null,null,null,null,null,null,null,null,null,null,null,null,null,null,null,null,null,null,null,null,null,null,null,null,null,null,null,null,null,null,null,null,null,null,null,null,null,null,null,null,null,null,"H",null,null,null,null,null,null,null,null,null,null,null,null,null,null,null,null,null,null,null,null,null,null,null,null,null,null,null,null,null,null,null,null,null,null,null,null,null,null,null,null,null,null,null,null,null,null,null,null,null,null,null,null,null,"H","H","H","H",null,null,null,null,null,null,null,null,null,null,null,null,null,null,null,null,null,null,null,null,"H","H",null,null,null,null,null,null,null,null,null,null,null,null,null,null,null,null,null,null,null,null,null,null,null,null,null,null,null,null,null,null,null,null,"ELEVATOR ","S6","S6","S6","S6","S6","S6","S6","S6","S6","S6","S6","S6","S6","S6","S6","S6","S6","S6","S6","S6","S6","S6","S6","S6","S6","S6","S6","S6","S6","S6","S7","S7","S7","S7","S7","S7","S7","S7","S7","S7","S7","S7","S7","S7","S7","S7","S7","S7","S7","S7","S7","S7","S7","S7","S7","S7","S7","S7","S7","S7","S8","S8","S8","S8","S8","S8","S8","S8","S8","S8","S8","S8","S8","S8","S8","H","S8","S8","S8","S8","S8",null,null,null,null,null,null,null,null,null,null,null,null,null,null,null,null,null,null,null,null,"H",null,null,null,null,null,null,null,null,null,null,null,null,null,null,null,null,null,null,null,null,null,null,null,null,null,null,null,null,null,null,null,null,null,null,null,null,null,null,null,null,null,null,null,null,"H"]
["Interior","Elevator","Elevator",null,null,"S2","Deck MEP & Reinforcing",null,null,null,null,null,null,null,null,null,null,null,null,null,null,null,null,null,null,null,null,null,null,null,null,null,null,null,null,null,null,null,null,null,null,null,null,null,null,null,null,null,null,null,null,null,null,null,null,null,null,null,null,null,null,null,null,null,null,null,null,null,null,null,null,null,null,null,null,null,null,null,null,null,null,null,null,null,null,null,null,null,null,null,null,null,null,null,null,null,null,"H",null,null,null,null,null,null,null,null,null,null,null,null,null,null,null,null,null,null,null,null,null,null,null,null,"H",null,null,null,null,null,null,null,null,null,null,null,null,null,null,null,null,null,null,null,null,null,null,null,null,null,null,null,null,null,null,null,null,null,null,null,null,null,null,null,null,null,null,null,null,null,null,"H",null,null,null,null,null,null,null,null,null,null,null,null,null,null,null,null,null,null,null,null,null,null,null,null,null,null,null,null,null,null,null,null,null,null,null,null,null,null,null,null,null,null,null,null,null,null,null,null,null,null,null,null,null,"H","H","H","H",null,null,null,null,null,null,null,null,null,null,null,null,null,null,null,null,null,null,null,null,"H","H",null,null,null,null,null,null,null,null,null,null,null,null,null,null,null,null,null,null,null,null,null,null,null,null,null,null,null,null,null,null,null,null,null,null,null,null,null,null,null,null,null,null,null,null,null,null,null,null,null,null,null,null,null,null,null,null,null,null,null,null,null,null,null,null,null,null,null,null,null,null,null,null,null,null,null,null,null,null,null,null,null,null,null,null,null,null,null,null,null,null,null,null,null,null,null,null,null,null,null,null,null,null,null,null,null,null,null,null,"H",null,null,"ELEVATOR ","S9","S9","S9","S9","S9","S9","S9","S9","S9","S9","S9","S9","S9","S9","S9","S9","S9","S9","S9","S9","S9","S9","H","S9","S9","S9","S9","S9","S9","S9","S9","S9","S9","S9","S9","S9",null,null,null,null,null,null,null,null,null,null,null,null,null,null,null,null,null,null,null,null,null,null,null,null,null,null,null,null,null,null,null,"H"]
["Interior","General","General",null,null,"S3","Deck Inspections & Place",null,null,null,null,null,null,null,null,null,null,null,null,null,null,null,null,null,null,null,"Notice to Proceed",null,null,null,null,null,null,null,null,null,null,null,null,null,null,null,null,null,null,null,null,null,null,null,null,null,null,null,null,null,null,null,null,null,null,null,null,null,null,null,null,null,null,null,null,null,null,null,null,null,null,null,null,null,null,null,null,null,null,null,null,null,null,null,null,null,null,null,null,null,null,"H",null,null,null,null,null,null,null,null,null,null,null,null,null,null,null,null,null,null,null,null,null,null,null,null,"H",null,null,null,null,null,null,null,null,null,null,null,null,null,null,null,null,null,null,null,null,null,null,null,null,null,null,null,null,null,null,null,null,null,null,null,null,null,null,null,null,null,null,null,null,null,null,"H",null,null,null,null,null,null,null,null,null,null,null,null,null,null,null,null,null,null,null,null,null,null,null,null,null,null,null,null,null,null,null,null,null,null,null,null,null,null,null,null,null,null,null,null,null,null,null,null,null,null,null,null,null,"H","H","H","H",null,null,null,null,null,null,null,null,null,null,null,null,null,null,null,null,null,null,null,null,"H","H",null,null,null,null,null,null,null,null,null,null,null,null,null,null,null,null,null,null,null,null,null,null,null,null,null,null,null,null,null,null,null,null,null,null,null,null,null,null,null,null,null,null,null,null,null,null,null,null,null,null,null,null,null,null,null,null,null,null,null,null,null,null,null,null,null,null,null,null,null,null,null,null,null,null,null,null,null,null,null,null,null,null,null,null,null,null,null,null,null,null,null,null,null,null,null,null,null,null,null,null,null,null,null,null,null,null,null,null,"H",null,null,null,null,null,null,null,null,null,null,null,null,null,null,null,null,null,null,null,null,null,null,null,null,null,"H",null,null,null,null,null,null,null,null,null,null,null,null,null,null,null,null,null,null,null,null,null,null,null,null,null,null,null,null,null,null,null,null,null,null,null,null,null,null,null,null,null,null,null,null,"H"]
["Interior","General","General",null,null,"S4","Columns & Walls",null,null,null,null,null,null,null,null,null,null,null,null,null,null,null,null,null,null,null,null,null,null,null,null,null,null,null,null,null,null,null,null,null,null,null,null,null,null,null,null,null,null,null,null,null,null,null,null,null,null,null,null,null,null,null,null,null,null,null,null,null,null,null,null,null,null,null,null,null,null,null,null,null,null,null,null,null,null,null,null,null,null,null,null,null,null,null,null,null,null,"H",null,null,null,null,null,null,null,null,null,null,null,null,null,null,null,null,null,null,null,null,null,null,null,null,"H",null,null,null,null,null,null,null,null,null,null,null,null,null,null,null,null,null,null,null,null,null,null,null,null,null,null,null,null,null,null,null,null,null,null,null,null,null,null,null,null,null,null,null,null,null,null,"H",null,null,null,null,null,null,null,null,null,null,null,null,null,null,null,null,null,null,null,null,null,null,null,null,null,null,null,null,null,null,null,null,null,null,null,null,null,null,null,null,null,null,null,null,null,null,null,null,null,null,null,null,null,"H","H","H","H",null,null,null,null,null,null,null,null,null,null,null,null,null,null,null,null,null,null,null,null,"H","H",null,null,null,null,null,null,null,null,null,null,null,null,null,null,null,null,null,null,null,null,null,null,null,null,null,null,null,null,null,null,null,null,null,null,null,null,null,null,null,null,null,null,null,null,null,null,null,null,null,null,null,null,null,null,null,null,null,null,null,null,null,null,null,null,null,null,null,null,null,null,null,null,null,null,null,null,null,null,null,null,null,null,null,null,null,null,null,null,null,null,null,null,null,null,null,null,null,null,null,null,null,null,null,null,null,null,null,null,"H",null,null,null,null,null,null,null,null,null,null,null,null,null,null,null,null,null,null,null,null,null,null,null,null,null,"H",null,null,null,null,null,null,null,null,null,null,null,null,null,null,null,null,null,null,null,null,null,null,null,null,null,null,null,null,null,null,null,null,null,null,null,null,null,null,null,null,null,null,null,null,"H"]
["Interior","Floor 1","Zone A",null,null,null,null,null,null,null,null,null,null,null,null,null,null,null,null,null,null,null,null,null,null,null,null,null,null,null,null,null,null,null,null,null,null,null,null,null,null,null,null,null,null,null,null,null,null,null,null,null,null,null,null,null,null,null,null,null,null,null,null,null,null,null,null,null,null,null,null,null,null,null,null,null,null,null,null,null,null,null,null,null,null,null,null,null,null,null,null,null,null,null,null,null,null,"H",null,null,null,null,null,null,null,null,null,null,null,null,null,null,null,null,null,null,null,null,null,null,null,null,"H",null,null,null,null,null,null,null,null,null,null,null,null,null,null,null,null,null,null,null,null,null,null,null,null,null,null,null,null,null,null,null,null,null,null,null,null,null,null,null,null,null,null,null,null,null,null,"H",null,null,null,null,null,null,null,null,null,null,null,null,null,null,null,null,null,null,null,null,null,null,null,null,null,null,null,null,null,null,null,null,null,null,null,null,null,null,null,null,null,null,null,null,null,null,null,null,null,null,null,null,null,"H","H","H","H",null,null,null,null,null,null,null,null,null,null,null,null,null,null,null,null,null,null,"ZONE 1A",1,"H","H",1,1,2,2,2,3,3,3,4,4,4,5,5,5,6,6,6,"B","B","B",7,7,7,8,8,8,"B","B","B",9,9,9,10,10,10,11,11,11,12,12,12,13,13,13,"B","B","B",14,14,14,15,15,15,null,null,null,null,null,null,null,null,null,null,null,null,null,null,null,null,null,null,null,null,null,null,null,null,null,null,null,null,null,null,null,null,null,null,null,null,null,null,null,null,null,null,null,null,null,null,null,null,null,null,null,null,null,null,null,"H",null,null,null,null,null,null,null,null,null,null,null,null,null,null,null,null,null,null,null,null,null,null,null,null,null,"H",null,null,null,null,null,null,null,null,null,null,null,null,null,null,null,null,null,null,null,null,null,null,null,null,null,null,null,null,null,null,null,null,null,null,null,null,null,null,null,null,null,null,null,null,"H"]
["Interior","Floor 1","Zone B",null,null,null,null,null,null,null,null,null,null,null,null,null,null,null,null,null,null,null,null,null,null,null,null,null,null,null,null,null,null,null,null,null,null,null,null,null,null,null,null,null,null,null,null,null,null,null,null,null,null,null,null,null,null,null,null,null,null,null,null,null,null,null,null,null,null,null,null,null,null,null,null,null,null,null,null,null,null,null,null,null,null,null,null,null,null,null,null,null,null,null,null,null,null,"H",null,null,null,null,null,null,null,null,null,null,null,null,null,null,null,null,null,null,null,null,null,null,null,null,"H",null,null,null,null,null,null,null,null,null,null,null,null,null,null,null,null,null,null,null,null,null,null,null,null,null,null,null,null,null,null,null,null,null,null,null,null,null,null,null,null,null,null,null,null,null,null,"H",null,null,null,null,null,null,null,null,null,null,null,null,null,null,null,null,null,null,null,null,null,null,null,null,null,null,null,null,null,null,null,null,null,null,null,null,null,null,null,null,null,null,null,null,null,null,null,null,null,null,null,null,null,"H","H","H","H",null,null,null,null,null,null,null,null,null,null,null,null,null,null,null,null,null,null,null,null,"H","H",null,"ZONE 1B",1,1,1,2,2,2,3,3,3,4,4,4,5,5,5,6,6,6,"B","B","B",7,7,7,8,8,8,"B","B","B",9,9,9,10,10,10,11,11,11,12,12,12,13,13,13,"B","B","B",14,14,14,15,15,15,null,null,null,null,null,null,null,null,null,null,null,null,null,null,null,null,null,null,null,null,null,null,null,null,null,null,null,null,null,null,null,null,null,null,null,null,null,null,null,null,null,null,null,null,null,null,null,null,null,null,null,null,"H",null,null,null,null,null,null,null,null,null,null,null,null,null,null,null,null,null,null,null,null,null,null,null,null,null,"H",null,null,null,null,null,null,null,null,null,null,null,null,null,null,null,null,null,null,null,null,null,null,null,null,null,null,null,null,null,null,null,null,null,null,null,null,null,null,null,null,null,null,null,null,"H"]
["Interior","Floor 1","Zone C",null,null,null,null,null,null,null,null,null,null,null,null,null,null,null,null,null,null,null,null,null,null,null,null,null,null,null,null,null,null,null,null,null,null,null,null,null,null,null,null,null,null,null,null,null,null,null,null,null,null,null,null,null,null,null,null,null,null,null,null,null,null,null,null,null,null,null,null,null,null,null,null,null,null,null,null,null,null,null,null,null,null,null,null,null,null,null,null,null,null,null,null,null,null,"H",null,null,null,null,null,null,null,null,null,null,null,null,null,null,null,null,null,null,null,null,null,null,null,null,"H",null,null,null,null,null,null,null,null,null,null,null,null,null,null,null,null,null,null,null,null,null,null,null,null,null,null,null,null,null,null,null,null,null,null,null,null,null,null,null,null,null,null,null,null,null,null,"H",null,null,null,null,null,null,null,null,null,null,null,null,null,null,null,null,null,null,null,null,null,null,null,null,null,null,null,null,null,null,null,null,null,null,null,null,null,null,null,null,null,null,null,null,null,null,null,null,null,null,null,null,null,"H","H","H","H",null,null,null,null,null,null,null,null,null,null,null,null,null,null,null,null,null,null,null,null,"H","H",null,null,null,null,"ZONE 1C",1,1,1,2,2,2,3,3,3,4,4,4,5,5,5,6,6,6,"B","B","B",7,7,7,8,8,8,"B","B","B",9,9,9,10,10,10,11,11,11,12,12,12,13,13,13,"B","B","B",14,14,14,15,15,15,null,null,null,null,null,null,null,null,null,null,null,null,null,null,null,null,null,null,null,null,null,null,null,null,null,null,null,null,null,null,null,null,null,null,null,null,null,null,null,null,null,null,null,null,null,null,null,null,null,"H",null,null,null,null,null,null,null,null,null,null,null,null,null,null,null,null,null,null,null,null,null,null,null,null,null,"H",null,null,null,null,null,null,null,null,null,null,null,null,null,null,null,null,null,null,null,null,null,null,null,null,null,null,null,null,null,null,null,null,null,null,null,null,null,null,null,null,null,null,null,null,"H"]
["Interior","Floor 1","General",null,null,null,null,null,null,null,null,null,null,null,null,null,null,null,null,null,null,null,null,null,null,null,null,null,null,null,null,null,null,null,null,null,null,null,null,null,null,null,null,null,null,null,null,null,null,null,null,null,null,null,null,null,null,null,null,null,null,null,null,null,null,null,null,null,null,null,null,null,null,null,null,null,null,null,null,null,null,null,null,null,null,null,null,null,null,null,null,null,null,null,null,null,null,"H",null,null,null,null,null,null,null,null,null,null,null,null,null,null,null,null,null,null,null,null,null,null,null,null,"H",null,null,null,null,null,null,null,null,null,null,null,null,null,null,null,null,null,null,null,null,null,null,null,null,null,null,null,null,null,null,null,null,null,null,null,null,null,null,null,null,null,null,null,null,null,null,"H",null,null,null,null,null,null,null,null,null,null,null,null,null,null,null,null,null,null,null,null,null,null,null,null,null,null,null,null,null,null,null,null,null,null,null,null,null,null,null,null,null,null,null,null,null,null,null,null,null,null,null,null,null,"H","H","H","H",null,null,null,null,null,null,null,null,null,null,null,null,null,null,null,null,null,null,null,null,"H","H",null,null,null,null,null,null,null,null,null,null,null,null,null,null,null,null,null,null,null,null,null,null,null,null,null,null,null,null,null,null,null,null,null,null,null,null,null,null,null,null,null,null,null,null,null,null,null,null,null,null,null,null,null,null,null,null,null,null,null,null,null,null,null,null,null,null,null,null,null,null,null,null,null,null,null,null,null,null,null,null,null,null,null,null,null,null,null,null,null,null,null,null,null,null,null,null,null,null,null,null,null,null,null,null,null,null,null,null,"H",null,null,null,null,null,null,null,null,null,null,null,null,null,null,null,null,null,null,null,null,null,null,null,null,null,"H",null,null,null,null,null,null,null,null,null,null,null,null,null,null,null,null,null,null,null,null,null,null,null,null,null,null,null,null,null,null,null,null,null,null,null,null,null,null,null,null,null,null,null,null,"H"]
["Interior","Floor 1","General",null,null,"STAIRS & ELEVATOR LEGEND",null,null,null,null,null,null,null,null,null,null,null,null,null,null,null,null,null,null,null,null,null,null,null,null,null,null,null,null,null,null,null,null,null,null,null,null,null,null,null,null,null,null,null,null,null,null,null,null,null,null,null,null,null,null,null,null,null,null,null,null,null,null,null,null,null,null,null,null,null,null,null,null,null,null,null,null,null,null,null,null,null,null,null,null,null,null,null,null,null,null,null,"H",null,null,null,null,null,null,null,null,null,null,null,null,null,null,null,null,null,null,null,null,null,null,null,null,"H",null,null,null,null,null,null,null,null,null,null,null,null,null,null,null,null,null,null,null,null,null,null,null,null,null,null,null,null,null,null,null,null,null,null,null,null,null,null,null,null,null,null,null,null,null,null,"H",null,null,null,null,null,null,null,null,null,null,null,null,null,null,null,null,null,null,null,null,null,null,null,null,null,null,null,null,null,null,null,null,null,null,null,null,null,null,null,null,null,null,null,null,null,null,null,null,null,null,null,null,null,"H","H","H","H",null,null,null,null,null,null,null,null,null,null,null,null,null,null,null,null,null,null,null,null,"H","H",null,null,null,null,null,null,null,null,null,null,null,null,null,null,null,null,null,null,null,null,null,null,null,null,null,null,null,null,null,null,null,null,null,null,null,null,null,null,null,null,null,null,null,null,null,null,null,null,null,null,null,null,null,null,null,null,null,null,null,null,null,null,null,null,null,null,null,null,null,null,null,null,null,null,null,null,null,null,null,null,null,null,null,null,null,null,null,null,null,null,null,null,null,null,null,null,null,null,null,null,null,null,null,null,null,null,null,null,"H",null,null,null,null,null,null,null,null,null,null,null,null,null,null,null,null,null,null,null,null,null,null,null,null,null,"H",null,null,null,null,null,null,null,null,null,null,null,null,null,null,null,null,null,null,null,null,null,null,null,null,null,null,null,null,null,null,null,null,null,null,null,null,null,null,null,null,null,null,null,null,"H"]
["Interior","Floor 2","Zone A",null,null,"S5","Erect Stair ",null,null,null,null,null,null,null,null,null,null,null,null,null,null,null,null,null,null,null,null,null,null,null,null,null,null,null,null,null,null,null,null,null,null,null,null,null,null,null,null,null,null,null,null,null,null,null,null,null,null,null,null,null,null,null,null,null,null,null,null,null,null,null,null,null,null,null,null,null,null,null,null,null,null,null,null,null,null,null,null,null,null,null,null,null,null,null,null,null,null,"H",null,null,null,null,null,null,null,null,null,null,null,null,null,null,null,null,null,null,null,null,null,null,null,null,"H",null,null,null,null,null,null,null,null,null,null,null,null,null,null,null,null,null,null,null,null,null,null,null,null,null,null,null,null,null,null,null,null,null,null,null,null,null,null,null,null,null,null,null,null,null,null,"H",null,null,null,null,null,null,null,null,null,null,null,null,null,null,null,null,null,null,null,null,null,null,null,null,null,null,null,null,null,null,null,null,null,null,null,null,null,null,null,null,null,null,null,null,null,null,null,null,null,null,null,null,null,"H","H","H","H",null,null,null,null,null,null,null,null,null,null,null,null,null,null,null,null,null,null,null,null,"H","H",null,null,null,null,null,null,null,"ZONE 2A",1,1,1,2,2,2,3,3,3,4,4,4,5,5,5,6,6,6,"B","B","B",7,7,7,8,8,8,"B","B","B",9,9,9,10,10,10,11,11,11,12,12,12,13,13,13,"B","B","B",14,14,14,15,15,15,null,null,null,null,null,null,null,null,null,null,null,null,null,null,null,null,null,null,null,null,null,null,null,null,null,null,null,null,null,null,null,null,null,null,null,null,null,null,null,null,null,null,null,null,null,null,"H",null,null,null,null,null,null,null,null,null,null,null,null,null,null,null,null,null,null,null,null,null,null,null,null,null,"H",null,null,null,null,null,null,null,null,null,null,null,null,null,null,null,null,null,null,null,null,null,null,null,null,null,null,null,null,null,null,null,null,null,null,null,null,null,null,null,null,null,null,null,null,"H"]
["Interior","Floor 2","Zone B",null,null,"C","Pour Concrete",null,null,null,null,null,null,null,null,null,null,null,null,null,null,null,null,null,null,null,null,null,null,null,null,null,null,null,null,null,null,null,null,null,null,null,null,null,null,null,null,null,null,null,null,null,null,null,null,null,null,null,null,null,null,null,null,null,null,null,null,null,null,null,null,null,null,null,null,null,null,null,null,null,null,null,null,null,null,null,null,null,null,null,null,null,null,null,null,null,null,"H",null,null,null,null,null,null,null,null,null,null,null,null,null,null,null,null,null,null,null,null,null,null,null,null,"H",null,null,null,null,null,null,null,null,null,null,null,null,null,null,null,null,null,null,null,null,null,null,null,null,null,null,null,null,null,null,null,null,null,null,null,null,null,null,null,null,null,null,null,null,null,null,"H",null,null,null,null,null,null,null,null,null,null,null,null,null,null,null,null,null,null,null,null,null,null,null,null,null,null,null,null,null,null,null,null,null,null,null,null,null,null,null,null,null,null,null,null,null,null,null,null,null,null,null,null,null,"H","H","H","H",null,null,null,null,null,null,null,null,null,null,null,null,null,null,null,null,null,null,null,null,"H","H",null,null,null,null,null,null,null,null,null,null,"ZONE 2B",1,1,1,2,2,2,3,3,3,4,4,4,5,5,5,6,6,6,"B","B","B",7,7,7,8,8,8,"B","B","B",9,9,9,10,10,10,11,11,11,12,12,12,13,13,13,"B","B","B",14,14,14,15,15,15,null,null,null,null,null,null,null,null,null,null,null,null,null,null,null,null,null,null,null,null,null,null,null,null,null,null,null,null,null,null,null,null,null,null,null,null,null,null,null,null,null,null,null,"H",null,null,null,null,null,null,null,null,null,null,null,null,null,null,null,null,null,null,null,null,null,null,null,null,null,"H",null,null,null,null,null,null,null,null,null,null,null,null,null,null,null,null,null,null,null,null,null,null,null,null,null,null,null,null,null,null,null,null,null,null,null,null,null,null,null,null,null,null,null,null,"H"]
["Interior","Floor 2","Zone C",null,null,"S6","Shaft Prep",null,null,null,null,null,null,null,null,null,null,null,null,null,null,null,null,null,null,null,null,null,null,null,null,null,null,null,null,null,null,null,null,null,null,null,null,null,null,null,null,null,null,null,null,null,null,null,null,null,null,null,null,null,null,null,null,null,null,null,null,null,null,null,null,null,null,null,null,null,null,null,null,null,null,null,null,null,null,null,null,null,null,null,null,null,null,null,null,null,null,"H",null,null,null,null,null,null,null,null,null,null,null,null,null,null,null,null,null,null,null,null,null,null,null,null,"H",null,null,null,null,null,null,null,null,null,null,null,null,null,null,null,null,null,null,null,null,null,null,null,null,null,null,null,null,null,null,null,null,null,null,null,null,null,null,null,null,null,null,null,null,null,null,"H",null,null,null,null,null,null,null,null,null,null,null,null,null,null,null,null,null,null,null,null,null,null,null,null,null,null,null,null,null,null,null,null,null,null,null,null,null,null,null,null,null,null,null,null,null,null,null,null,null,null,null,null,null,"H","H","H","H",null,null,null,null,null,null,null,null,null,null,null,null,null,null,null,null,null,null,null,null,"H","H",null,null,null,null,null,null,null,null,null,null,null,null,null,"ZONE 2C",1,1,1,2,2,2,3,3,3,4,4,4,5,5,5,6,6,6,"B","B","B",7,7,7,8,8,8,"B","B","B",9,9,9,10,10,10,11,11,11,12,12,12,13,13,13,"B","B","B",14,14,14,15,15,15,null,null,null,null,null,null,null,null,null,null,null,null,null,null,null,null,null,null,null,null,null,null,null,null,null,null,null,null,null,null,null,null,null,null,null,null,null,null,null,null,"H",null,null,null,null,null,null,null,null,null,null,null,null,null,null,null,null,null,null,null,null,null,null,null,null,null,"H",null,null,null,null,null,null,null,null,null,null,null,null,null,null,null,null,null,null,null,null,null,null,null,null,null,null,null,null,null,null,null,null,null,null,null,null,null,null,null,null,null,null,null,null,"H"]
["Interior","Floor 2","Zone D",null,null,"S7","Elevator Cabs",null,null,null,null,null,null,null,null,null,null,null,null,null,null,null,null,null,null,null,null,null,null,null,null,null,null,null,null,null,null,null,null,null,null,null,null,null,null,null,null,null,null,null,null,null,null,null,null,null,null,null,null,null,null,null,null,null,null,null,null,null,null,null,null,null,null,null,null,null,null,null,null,null,null,null,null,null,null,null,null,null,null,null,null,null,null,null,null,null,null,"H",null,null,null,null,null,null,null,null,null,null,null,null,null,null,null,null,null,null,null,null,null,null,null,null,"H",null,null,null,null,null,null,null,null,null,null,null,null,null,null,null,null,null,null,null,null,null,null,null,null,null,null,null,null,null,null,null,null,null,null,null,null,null,null,null,null,null,null,null,null,null,null,"H",null,null,null,null,null,null,null,null,null,null,null,null,null,null,null,null,null,null,null,null,null,null,null,null,null,null,null,null,null,null,null,null,null,null,null,null,null,null,null,null,null,null,null,null,null,null,null,null,null,null,null,null,null,"H","H","H","H",null,null,null,null,null,null,null,null,null,null,null,null,null,null,null,null,null,null,null,null,"H","H",null,null,null,null,null,null,null,null,null,null,null,null,null,null,null,null,"ZONE 2D",1,1,1,2,2,2,3,3,3,4,4,4,5,5,5,6,6,6,"B","B","B",7,7,7,8,8,8,"B","B","B",9,9,9,10,10,10,11,11,11,12,12,12,13,13,13,"B","B","B",14,14,14,15,15,15,null,null,null,null,null,null,null,null,null,null,null,null,null,null,null,null,null,null,null,null,null,null,null,null,null,null,null,null,null,null,null,null,null,null,null,null,null,"H",null,null,null,null,null,null,null,null,null,null,null,null,null,null,null,null,null,null,null,null,null,null,null,null,null,"H",null,null,null,null,null,null,null,null,null,null,null,null,null,null,null,null,null,null,null,null,null,null,null,null,null,null,null,null,null,null,null,null,null,null,null,null,null,null,null,null,null,null,null,null,"H"]
["Interior","Floor 2","Zone E",null,null,"S8","Certification",null,null,null,null,null,null,null,null,null,null,null,null,null,null,null,null,null,null,null,null,null,null,null,null,null,null,null,null,null,null,null,null,null,null,null,null,null,null,null,null,null,null,null,null,null,null,null,null,null,null,null,null,null,null,null,null,null,null,null,null,null,null,null,null,null,null,null,null,null,null,null,null,null,null,null,null,null,null,null,null,null,null,null,null,null,null,null,null,null,null,"H",null,null,null,null,null,null,null,null,null,null,null,null,null,null,null,null,null,null,null,null,null,null,null,null,"H",null,null,null,null,null,null,null,null,null,null,null,null,null,null,null,null,null,null,null,null,null,null,null,null,null,null,null,null,null,null,null,null,null,null,null,null,null,null,null,null,null,null,null,null,null,null,"H",null,null,null,null,null,null,null,null,null,null,null,null,null,null,null,null,null,null,null,null,null,null,null,null,null,null,null,null,null,null,null,null,null,null,null,null,null,null,null,null,null,null,null,null,null,null,null,null,null,null,null,null,null,"H","H","H","H",null,null,null,null,null,null,null,null,null,null,null,null,null,null,null,null,null,null,null,null,"H","H",null,null,null,null,null,null,null,null,null,null,null,null,null,null,null,null,null,null,null,"ZONE 2E",1,1,1,2,2,2,3,3,3,4,4,4,5,5,5,6,6,6,"B","B","B",7,7,7,8,8,8,"B","B","B",9,9,9,10,10,10,11,11,11,12,12,12,13,13,13,"B","B","B",14,14,14,15,15,15,null,null,null,null,null,null,null,null,null,null,null,null,null,null,null,null,null,null,null,null,null,null,null,null,null,null,null,null,null,null,null,null,null,null,"H",null,null,null,null,null,null,null,null,null,null,null,null,null,null,null,null,null,null,null,null,null,null,null,null,null,"H",null,null,null,null,null,null,null,null,null,null,null,null,null,null,null,null,null,null,null,null,null,null,null,null,null,null,null,null,null,null,null,null,null,null,null,null,null,null,null,null,null,null,null,null,"H"]
["Interior","Floor 2","Zone F",null,null,"S9","Comeback Areas for Elevator",null,null,null,null,null,null,null,null,null,null,null,null,null,null,null,null,null,null,null,null,null,null,null,null,null,null,null,null,null,null,null,null,null,null,null,null,null,null,null,null,null,null,null,null,null,null,null,null,null,null,null,null,null,null,null,null,null,null,null,null,null,null,null,null,null,null,null,null,null,null,null,null,null,null,null,null,null,null,null,null,null,null,null,null,null,null,null,null,null,null,"H",null,null,null,null,null,null,null,null,null,null,null,null,null,null,null,null,null,null,null,null,null,null,null,null,"H",null,null,null,null,null,null,null,null,null,null,null,null,null,null,null,null,null,null,null,null,null,null,null,null,null,null,null,null,null,null,null,null,null,null,null,null,null,null,null,null,null,null,null,null,null,null,"H",null,null,null,null,null,null,null,null,null,null,null,null,null,null,null,null,null,null,null,null,null,null,null,null,null,null,null,null,null,null,null,null,null,null,null,null,null,null,null,null,null,null,null,null,null,null,null,null,null,null,null,null,null,"H","H","H","H",null,null,null,null,null,null,null,null,null,null,null,null,null,null,null,null,null,null,null,null,"H","H",null,null,null,null,null,null,null,null,null,null,null,null,null,null,null,null,null,null,null,null,null,null,"ZONE 2F",1,1,1,2,2,2,3,3,3,4,4,4,5,5,5,6,6,6,"B","B","B",7,7,7,8,8,8,"B","B","B",9,9,9,10,10,10,11,11,11,12,12,12,13,13,13,"B","B","B",14,14,14,15,15,15,null,null,null,null,null,null,null,null,null,null,null,null,null,null,null,null,null,null,null,null,null,null,null,null,null,null,null,null,null,null,null,"H",null,null,null,null,null,null,null,null,null,null,null,null,null,null,null,null,null,null,null,null,null,null,null,null,null,"H",null,null,null,null,null,null,null,null,null,null,null,null,null,null,null,null,null,null,null,null,null,null,null,null,null,null,null,null,null,null,null,null,null,null,null,null,null,null,null,null,null,null,null,null,"H"]
["Interior","Floor 2","Zone G",null,null,null,null,null,null,null,null,null,null,null,null,null,null,null,null,null,null,null,null,null,null,null,null,null,null,null,null,null,null,null,null,null,null,null,null,null,null,null,null,null,null,null,null,null,null,null,null,null,null,null,null,null,null,null,null,null,null,null,null,null,null,null,null,null,null,null,null,null,null,null,null,null,null,null,null,null,null,null,null,null,null,null,null,null,null,null,null,null,null,null,null,null,null,"H",null,null,null,null,null,null,null,null,null,null,null,null,null,null,null,null,null,null,null,null,null,null,null,null,"H",null,null,null,null,null,null,null,null,null,null,null,null,null,null,null,null,null,null,null,null,null,null,null,null,null,null,null,null,null,null,null,null,null,null,null,null,null,null,null,null,null,null,null,null,null,null,"H",null,null,null,null,null,null,null,null,null,null,null,null,null,null,null,null,null,null,null,null,null,null,null,null,null,null,null,null,null,null,null,null,null,null,null,null,null,null,null,null,null,null,null,null,null,null,null,null,null,null,null,null,null,"H","H","H","H",null,null,null,null,null,null,null,null,null,null,null,null,null,null,null,null,null,null,null,null,"H","H",null,null,null,null,null,null,null,null,null,null,null,null,null,null,null,null,null,null,null,null,null,null,null,null,null,"ZONE 2G",1,1,1,2,2,2,3,3,3,4,4,4,5,5,5,6,6,6,"B","B","B",7,7,7,8,8,8,"B","B","B",9,9,9,10,10,10,11,11,11,12,12,12,13,13,13,"B","B","B",14,14,14,15,15,15,null,null,null,null,null,null,null,null,null,null,null,null,null,null,null,null,null,null,null,null,null,null,null,null,null,null,null,null,"H",null,null,null,null,null,null,null,null,null,null,null,null,null,null,null,null,null,null,null,null,null,null,null,null,null,"H",null,null,null,null,null,null,null,null,null,null,null,null,null,null,null,null,null,null,null,null,null,null,null,null,null,null,null,null,null,null,null,null,null,null,null,null,null,null,null,null,null,null,null,null,"H"]
["Interior","Floor 2","Zone H",null,null,null,null,null,null,null,null,null,null,null,null,null,null,null,null,null,null,null,null,null,null,null,null,null,null,null,null,null,null,null,null,null,null,null,null,null,null,null,null,null,null,null,null,null,null,null,null,null,null,null,null,null,null,null,null,null,null,null,null,null,null,null,null,null,null,null,null,null,null,null,null,null,null,null,null,null,null,null,null,null,null,null,null,null,null,null,null,null,null,null,null,null,null,"H",null,null,null,null,null,null,null,null,null,null,null,null,null,null,null,null,null,null,null,null,null,null,null,null,"H",null,null,null,null,null,null,null,null,null,null,null,null,null,null,null,null,null,null,null,null,null,null,null,null,null,null,null,null,null,null,null,null,null,null,null,null,null,null,null,null,null,null,null,null,null,null,"H",null,null,null,null,null,null,null,null,null,null,null,null,null,null,null,null,null,null,null,null,null,null,null,null,null,null,null,null,null,null,null,null,null,null,null,null,null,null,null,null,null,null,null,null,null,null,null,null,null,null,null,null,null,"H","H","H","H",null,null,null,null,null,null,null,null,null,null,null,null,null,null,null,null,null,null,null,null,"H","H",null,null,null,null,null,null,null,null,null,null,null,null,null,null,null,null,null,null,null,null,null,null,null,null,null,null,null,null,"ZONE 2H",1,1,1,2,2,2,3,3,3,4,4,4,5,5,5,6,6,6,"B","B","B",7,7,7,8,8,8,"B","B","B",9,9,9,10,10,10,11,11,11,12,12,12,13,13,13,"B","B","B",14,14,14,15,15,15,null,null,null,null,null,null,null,null,null,null,null,null,null,null,null,null,null,null,null,null,null,null,null,null,null,"H",null,null,null,null,null,null,null,null,null,null,null,null,null,null,null,null,null,null,null,null,null,null,null,null,null,"H",null,null,null,null,null,null,null,null,null,null,null,null,null,null,null,null,null,null,null,null,null,null,null,null,null,null,null,null,null,null,null,null,null,null,null,null,null,null,null,null,null,null,null,null,"H"]
["Interior","Floor 2","Zone I",null,null,null,null,null,null,null,null,null,null,null,null,null,null,null,null,null,null,null,null,null,null,null,null,null,null,null,null,null,null,null,null,null,null,null,null,null,null,null,null,null,null,null,null,null,null,null,null,null,null,null,null,null,null,null,null,null,null,null,null,null,null,null,null,null,null,null,null,null,null,null,null,null,null,null,null,null,null,null,null,null,null,null,null,null,null,null,null,null,null,null,null,null,null,"H",null,null,null,null,null,null,null,null,null,null,null,null,null,null,null,null,null,null,null,null,null,null,null,null,"H",null,null,null,null,null,null,null,null,null,null,null,null,null,null,null,null,null,null,null,null,null,null,null,null,null,null,null,null,null,null,null,null,null,null,null,null,null,null,null,null,null,null,null,null,null,null,"H",null,null,null,null,null,null,null,null,null,null,null,null,null,null,null,null,null,null,null,null,null,null,null,null,null,null,null,null,null,null,null,null,null,null,null,null,null,null,null,null,null,null,null,null,null,null,null,null,null,null,null,null,null,"H","H","H","H",null,null,null,null,null,null,null,null,null,null,null,null,null,null,null,null,null,null,null,null,"H","H",null,null,null,null,null,null,null,null,null,null,null,null,null,null,null,null,null,null,null,null,null,null,null,null,null,null,null,null,null,null,null,"ZONE 2I",1,1,1,2,2,2,3,3,3,4,4,4,5,5,5,6,6,6,"B","B","B",7,7,7,8,8,8,"B","B","B",9,9,9,10,10,10,11,11,11,12,12,12,13,13,13,"B","B","B",14,14,14,15,15,15,null,null,null,null,null,null,null,null,null,null,null,null,null,null,null,null,null,null,null,null,null,null,"H",null,null,null,null,null,null,null,null,null,null,null,null,null,null,null,null,null,null,null,null,null,null,null,null,null,"H",null,null,null,null,null,null,null,null,null,null,null,null,null,null,null,null,null,null,null,null,null,null,null,null,null,null,null,null,null,null,null,null,null,null,null,null,null,null,null,null,null,null,null,null,"H"]
["Interior","Floor 2","Zone J",null,null,null,null,null,null,null,null,null,null,null,null,null,null,null,null,null,null,null,null,null,null,null,null,null,null,null,null,null,null,null,null,null,null,null,null,null,null,null,null,null,null,null,null,null,null,null,null,null,null,null,null,null,null,null,null,null,null,null,null,null,null,null,null,null,null,null,null,null,null,null,null,null,null,null,null,null,null,null,null,null,null,null,null,null,null,null,null,null,null,null,null,null,null,"H",null,null,null,null,null,null,null,null,null,null,null,null,null,null,null,null,null,null,null,null,null,null,null,null,"H",null,null,null,null,null,null,null,null,null,null,null,null,null,null,null,null,null,null,null,null,null,null,null,null,null,null,null,null,null,null,null,null,null,null,null,null,null,null,null,null,null,null,null,null,null,null,"H",null,null,null,null,null,null,null,null,null,null,null,null,null,null,null,null,null,null,null,null,null,null,null,null,null,null,null,null,null,null,null,null,null,null,null,null,null,null,null,null,null,null,null,null,null,null,null,null,null,null,null,null,null,"H","H","H","H",null,null,null,null,null,null,null,null,null,null,null,null,null,null,null,null,null,null,null,null,"H","H",null,null,null,null,null,null,null,null,null,null,null,null,null,null,null,null,null,null,null,null,null,null,null,null,null,null,null,null,null,null,null,null,null,null,"ZONE 2J",1,1,1,2,2,2,3,3,3,4,4,4,5,5,5,6,6,6,"B","B","B",7,7,7,8,8,8,"B","B","B",9,9,9,10,10,10,11,11,11,12,12,12,13,13,13,"B","B","B",14,14,14,15,15,15,null,null,null,null,null,null,null,null,null,null,null,null,null,null,null,null,null,null,null,"H",null,null,null,null,null,null,null,null,null,null,null,null,null,null,null,null,null,null,null,null,null,null,null,null,null,"H",null,null,null,null,null,null,null,null,null,null,null,null,null,null,null,null,null,null,null,null,null,null,null,null,null,null,null,null,null,null,null,null,null,null,null,null,null,null,null,null,null,null,null,null,"H"]
["Interior","Floor 2","Zone K",null,null,"INTERIOR LEGEND",null,null,null,null,null,null,null,null,null,null,null,null,null,null,null,null,null,null,null,null,null,null,null,null,null,null,null,null,null,null,null,null,null,null,null,null,null,null,null,null,null,null,null,null,null,null,null,null,null,null,null,null,null,null,null,null,null,null,null,null,null,null,null,null,null,null,null,null,null,null,null,null,null,null,null,null,null,null,null,null,null,null,null,null,null,null,null,null,null,null,null,"H",null,null,null,null,null,null,null,null,null,null,null,null,null,null,null,null,null,null,null,null,null,null,null,null,"H",null,null,null,null,null,null,null,null,null,null,null,null,null,null,null,null,null,null,null,null,null,null,null,null,null,null,null,null,null,null,null,null,null,null,null,null,null,null,null,null,null,null,null,null,null,null,"H",null,null,null,null,null,null,null,null,null,null,null,null,null,null,null,null,null,null,null,null,null,null,null,null,null,null,null,null,null,null,null,null,null,null,null,null,null,null,null,null,null,null,null,null,null,null,null,null,null,null,null,null,null,"H","H","H","H",null,null,null,null,null,null,null,null,null,null,null,null,null,null,null,null,null,null,null,null,"H","H",null,null,null,null,null,null,null,null,null,null,null,null,null,null,null,null,null,null,null,null,null,null,null,null,null,null,null,null,null,null,null,null,null,null,null,null,null,"ZONE 2K",1,1,1,2,2,2,3,3,3,4,4,4,5,5,5,6,6,6,"B","B","B",7,7,7,8,8,8,"B","B","B",9,9,9,10,10,10,11,11,11,12,12,12,13,13,13,"B","B","B",14,14,14,15,15,15,null,null,null,null,null,null,null,null,null,null,null,null,null,null,null,null,"H",null,null,null,null,null,null,null,null,null,null,null,null,null,null,null,null,null,null,null,null,null,null,null,null,null,"H",null,null,null,null,null,null,null,null,null,null,null,null,null,null,null,null,null,null,null,null,null,null,null,null,null,null,null,null,null,null,null,null,null,null,null,null,null,null,null,null,null,null,null,null,"H"]
["Interior","Floor 2","General",null,null,1,"Remove Reshores, Floor Prep & Wall Layout",null,null,null,null,null,null,null,null,null,null,null,null,null,null,null,null,null,null,null,null,null,null,null,null,null,null,null,null,null,null,null,null,null,null,null,null,null,null,null,null,null,null,null,null,null,null,null,null,null,null,null,null,null,null,null,null,null,null,null,null,null,null,null,null,null,null,null,null,null,null,null,null,null,null,null,null,null,null,null,null,null,null,null,null,null,null,null,null,null,null,"H",null,null,null,null,null,null,null,null,null,null,null,null,null,null,null,null,null,null,null,null,null,null,null,null,"H",null,null,null,null,null,null,null,null,null,null,null,null,null,null,null,null,null,null,null,null,null,null,null,null,null,null,null,null,null,null,null,null,null,null,null,null,null,null,null,null,null,null,null,null,null,null,"H",null,null,null,null,null,null,null,null,null,null,null,null,null,null,null,null,null,null,null,null,null,null,null,null,null,null,null,null,null,null,null,null,null,null,null,null,null,null,null,null,null,null,null,null,null,null,null,null,null,null,null,null,null,"H","H","H","H",null,null,null,null,null,null,null,null,null,null,null,null,null,null,null,null,null,null,null,null,"H","H",null,null,null,null,null,null,null,null,null,null,null,null,null,null,null,null,null,null,null,null,null,null,null,null,null,null,null,null,null,null,null,null,null,null,null,null,null,null,null,null,null,null,null,null,null,null,null,null,null,null,null,null,null,null,null,null,null,null,null,null,null,null,null,null,null,null,null,null,null,null,null,null,null,null,null,null,null,null,null,null,null,null,null,null,null,null,null,null,null,null,null,null,null,null,null,null,null,null,null,null,null,null,null,null,null,null,null,null,"H",null,null,null,null,null,null,null,null,null,null,null,null,null,null,null,null,null,null,null,null,null,null,null,null,null,"H",null,null,null,null,null,null,null,null,null,null,null,null,null,null,null,null,null,null,null,null,null,null,null,null,null,null,null,null,null,null,null,null,null,null,null,null,null,null,null,null,null,null,null,null,"H"]
["Interior","Floor 2","General",null,null,2,"Fire Sprinkler & Install Walls",null,null,null,null,null,null,null,null,null,null,null,null,null,null,null,null,null,null,null,null,null,null,null,null,null,null,null,null,null,null,null,null,null,null,null,null,null,null,null,null,null,null,null,null,null,null,null,null,null,null,null,null,null,null,null,null,null,null,null,null,null,null,null,null,null,null,null,null,null,null,null,null,null,null,null,null,null,null,null,null,null,null,null,null,null,null,null,null,null,null,"H",null,null,null,null,null,null,null,null,null,null,null,null,null,null,null,null,null,null,null,null,null,null,null,null,"H",null,null,null,null,null,null,null,null,null,null,null,null,null,null,null,null,null,null,null,null,null,null,null,null,null,null,null,null,null,null,null,null,null,null,null,null,null,null,null,null,null,null,null,null,null,null,"H",null,null,null,null,null,null,null,null,null,null,null,null,null,null,null,null,null,null,null,null,null,null,null,null,null,null,null,null,null,null,null,null,null,null,null,null,null,null,null,null,null,null,null,null,null,null,null,null,null,null,null,null,null,"H","H","H","H",null,null,null,null,null,null,null,null,null,null,null,null,null,null,null,null,null,null,null,null,"H","H",null,null,null,null,null,null,null,null,null,null,null,null,null,null,null,null,null,null,null,null,null,null,null,null,null,null,null,null,null,null,null,null,null,null,null,null,null,null,null,null,null,null,null,null,null,null,null,null,null,null,null,null,null,null,null,null,null,null,null,null,null,null,null,null,null,null,null,null,null,null,null,null,null,null,null,null,null,null,null,null,null,null,null,null,null,null,null,null,null,null,null,null,null,null,null,null,null,null,null,null,null,null,null,null,null,null,null,null,"H",null,null,null,null,null,null,null,null,null,null,null,null,null,null,null,null,null,null,null,null,null,null,null,null,null,"H",null,null,null,null,null,null,null,null,null,null,null,null,null,null,null,null,null,null,null,null,null,null,null,null,null,null,null,null,null,null,null,null,null,null,null,null,null,null,null,null,null,null,null,null,"H"]
["Interior","Floor 3","Zone A",null,null,3,"OH Mechanical Duct",null,null,null,null,null,null,null,null,null,null,null,null,null,null,null,null,null,null,null,null,null,null,null,null,null,null,null,null,null,null,null,null,null,null,null,null,null,null,null,null,null,null,null,null,null,null,null,null,null,null,null,null,null,null,null,null,null,null,null,null,null,null,null,null,null,null,null,null,null,null,null,null,null,null,null,null,null,null,null,null,null,null,null,null,null,null,null,null,null,null,"H",null,null,null,null,null,null,null,null,null,null,null,null,null,null,null,null,null,null,null,null,null,null,null,null,"H",null,null,null,null,null,null,null,null,null,null,null,null,null,null,null,null,null,null,null,null,null,null,null,null,null,null,null,null,null,null,null,null,null,null,null,null,null,null,null,null,null,null,null,null,null,null,"H",null,null,null,null,null,null,null,null,null,null,null,null,null,null,null,null,null,null,null,null,null,null,null,null,null,null,null,null,null,null,null,null,null,null,null,null,null,null,null,null,null,null,null,null,null,null,null,null,null,null,null,null,null,"H","H","H","H",null,null,null,null,null,null,null,null,null,null,null,null,null,null,null,null,null,null,null,null,"H","H",null,null,null,null,null,null,null,null,null,null,null,null,null,null,null,null,null,null,null,null,null,null,null,null,null,null,null,null,null,null,null,null,null,null,null,null,null,null,null,null,"ZONE 3A",1,1,1,2,2,2,3,3,3,4,4,4,5,5,5,6,6,6,"B","B","B",7,7,7,8,8,8,"B","B","B",9,9,9,10,10,10,11,11,11,12,12,12,13,13,13,"B","B","B",14,14,14,15,15,15,null,null,null,null,null,null,null,null,null,null,null,null,null,"H",null,null,null,null,null,null,null,null,null,null,null,null,null,null,null,null,null,null,null,null,null,null,null,null,null,"H",null,null,null,null,null,null,null,null,null,null,null,null,null,null,null,null,null,null,null,null,null,null,null,null,null,null,null,null,null,null,null,null,null,null,null,null,null,null,null,null,null,null,null,null,"H"]
["Interior","Floor 3","Zone B",null,null,4,"OH Mech Equip, Piping, Branch Lines & Plumbing",null,null,null,null,null,null,null,null,null,null,null,null,null,null,null,null,null,null,null,null,null,null,null,null,null,null,null,null,null,null,null,null,null,null,null,null,null,null,null,null,null,null,null,null,null,null,null,null,null,null,null,null,null,null,null,null,null,null,null,null,null,null,null,null,null,null,null,null,null,null,null,null,null,null,null,null,null,null,null,null,null,null,null,null,null,null,null,null,null,null,"H",null,null,null,null,null,null,null,null,null,null,null,null,null,null,null,null,null,null,null,null,null,null,null,null,"H",null,null,null,null,null,null,null,null,null,null,null,null,null,null,null,null,null,null,null,null,null,null,null,null,null,null,null,null,null,null,null,null,null,null,null,null,null,null,null,null,null,null,null,null,null,null,"H",null,null,null,null,null,null,null,null,null,null,null,null,null,null,null,null,null,null,null,null,null,null,null,null,null,null,null,null,null,null,null,null,null,null,null,null,null,null,null,null,null,null,null,null,null,null,null,null,null,null,null,null,null,"H","H","H","H",null,null,null,null,null,null,null,null,null,null,null,null,null,null,null,null,null,null,null,null,"H","H",null,null,null,null,null,null,null,null,null,null,null,null,null,null,null,null,null,null,null,null,null,null,null,null,null,null,null,null,null,null,null,null,null,null,null,null,null,null,null,null,null,null,null,"ZONE 3B",1,1,1,2,2,2,3,3,3,4,4,4,5,5,5,6,6,6,"B","B","B",7,7,7,8,8,8,"B","B","B",9,9,9,10,10,10,11,11,11,12,12,12,13,13,13,"B","B","B",14,14,14,15,15,15,null,null,null,null,null,null,null,null,null,null,"H",null,null,null,null,null,null,null,null,null,null,null,null,null,null,null,null,null,null,null,null,null,null,null,null,null,"H",null,null,null,null,null,null,null,null,null,null,null,null,null,null,null,null,null,null,null,null,null,null,null,null,null,null,null,null,null,null,null,null,null,null,null,null,null,null,null,null,null,null,null,null,"H"]
["Interior","Floor 3","Zone C",null,null,5,"OH Electrical & Frame Walls",null,null,null,null,null,null,null,null,null,null,null,null,null,null,null,null,null,null,null,null,null,null,null,null,null,null,null,null,null,null,null,null,null,null,null,null,null,null,null,null,null,null,null,null,null,null,null,null,null,null,null,null,null,null,null,null,null,null,null,null,null,null,null,null,null,null,null,null,null,null,null,null,null,null,null,null,null,null,null,null,null,null,null,null,null,null,null,null,null,null,"H",null,null,null,null,null,null,null,null,null,null,null,null,null,null,null,null,null,null,null,null,null,null,null,null,"H",null,null,null,null,null,null,null,null,null,null,null,null,null,null,null,null,null,null,null,null,null,null,null,null,null,null,null,null,null,null,null,null,null,null,null,null,null,null,null,null,null,null,null,null,null,null,"H",null,null,null,null,null,null,null,null,null,null,null,null,null,null,null,null,null,null,null,null,null,null,null,null,null,null,null,null,null,null,null,null,null,null,null,null,null,null,null,null,null,null,null,null,null,null,null,null,null,null,null,null,null,"H","H","H","H",null,null,null,null,null,null,null,null,null,null,null,null,null,null,null,null,null,null,null,null,"H","H",null,null,null,null,null,null,null,null,null,null,null,null,null,null,null,null,null,null,null,null,null,null,null,null,null,null,null,null,null,null,null,null,null,null,null,null,null,null,null,null,null,null,null,null,null,null,"ZONE 3C",1,1,1,2,2,2,3,3,3,4,4,4,5,5,5,6,6,6,"B","B","B",7,7,7,8,8,8,"B","B","B",9,9,9,10,10,10,11,11,11,12,12,12,13,13,13,"B","B","B",14,14,14,15,15,15,null,null,null,null,null,null,null,"H",null,null,null,null,null,null,null,null,null,null,null,null,null,null,null,null,null,null,null,null,null,null,null,null,null,"H",null,null,null,null,null,null,null,null,null,null,null,null,null,null,null,null,null,null,null,null,null,null,null,null,null,null,null,null,null,null,null,null,null,null,null,null,null,null,null,null,null,null,null,null,"H"]
["Interior","Floor 3","Zone D",null,null,6,"Frame Walls, Install In-wall Electrical & Plumbing",null,null,null,null,null,null,null,null,null,null,null,null,null,null,null,null,null,null,null,null,null,null,null,null,null,null,null,null,null,null,null,null,null,null,null,null,null,null,null,null,null,null,null,null,null,null,null,null,null,null,null,null,null,null,null,null,null,null,null,null,null,null,null,null,null,null,null,null,null,null,null,null,null,null,null,null,null,null,null,null,null,null,null,null,null,null,null,null,null,null,"H",null,null,null,null,null,null,null,null,null,null,null,null,null,null,null,null,null,null,null,null,null,null,null,null,"H",null,null,null,null,null,null,null,null,null,null,null,null,null,null,null,null,null,null,null,null,null,null,null,null,null,null,null,null,null,null,null,null,null,null,null,null,null,null,null,null,null,null,null,null,null,null,"H",null,null,null,null,null,null,null,null,null,null,null,null,null,null,null,null,null,null,null,null,null,null,null,null,null,null,null,null,null,null,null,null,null,null,null,null,null,null,null,null,null,null,null,null,null,null,null,null,null,null,null,null,null,"H","H","H","H",null,null,null,null,null,null,null,null,null,null,null,null,null,null,null,null,null,null,null,null,"H","H",null,null,null,null,null,null,null,null,null,null,null,null,null,null,null,null,null,null,null,null,null,null,null,null,null,null,null,null,null,null,null,null,null,null,null,null,null,null,null,null,null,null,null,null,null,null,null,null,null,"ZONE 3D",1,1,1,2,2,2,3,3,3,4,4,4,5,5,5,6,6,6,"B","B","B",7,7,7,8,8,8,"B","B","B",9,9,9,10,10,10,11,11,11,12,12,12,13,13,13,"B","B","B",14,14,14,15,15,15,null,null,null,null,"H",null,null,null,null,null,null,null,null,null,null,null,null,null,null,null,null,null,null,null,null,null,null,null,null,null,"H",null,null,null,null,null,null,null,null,null,null,null,null,null,null,null,null,null,null,null,null,null,null,null,null,null,null,null,null,null,null,null,null,null,null,null,null,null,null,null,null,null,null,null,null,"H"]
["Interior","Floor 3","Zone E",null,null,7,"In-wall Process Piping, 1st Drywall, Insulation & Insp",null,null,null,null,null,null,null,null,null,null,null,null,null,null,null,null,null,null,null,null,null,null,null,null,null,null,null,null,null,null,null,null,null,null,null,null,null,null,null,null,null,null,null,null,null,null,null,null,null,null,null,null,null,null,null,null,null,null,null,null,null,null,null,null,null,null,null,null,null,null,null,null,null,null,null,null,null,null,null,null,null,null,null,null,null,null,null,null,null,null,"H",null,null,null,null,null,null,null,null,null,null,null,null,null,null,null,null,null,null,null,null,null,null,null,null,"H",null,null,null,null,null,null,null,null,null,null,null,null,null,null,null,null,null,null,null,null,null,null,null,null,null,null,null,null,null,null,null,null,null,null,null,null,null,null,null,null,null,null,null,null,null,null,"H",null,null,null,null,null,null,null,null,null,null,null,null,null,null,null,null,null,null,null,null,null,null,null,null,null,null,null,null,null,null,null,null,null,null,null,null,null,null,null,null,null,null,null,null,null,null,null,null,null,null,null,null,null,"H","H","H","H",null,null,null,null,null,null,null,null,null,null,null,null,null,null,null,null,null,null,null,null,"H","H",null,null,null,null,null,null,null,null,null,null,null,null,null,null,null,null,null,null,null,null,null,null,null,null,null,null,null,null,null,null,null,null,null,null,null,null,null,null,null,null,null,null,null,null,null,null,null,null,null,null,null,null,"ZONE 3E",1,1,1,2,2,2,3,3,3,4,4,4,5,5,5,6,6,6,"B","B","B",7,7,7,8,8,8,"B","B","B",9,9,9,10,10,10,11,11,11,12,12,12,13,13,13,"B","B","B",14,14,14,15,15,15,null,"H",null,null,null,null,null,null,null,null,null,null,null,null,null,null,null,null,null,null,null,null,null,null,null,null,null,"H",null,null,null,null,null,null,null,null,null,null,null,null,null,null,null,null,null,null,null,null,null,null,null,null,null,null,null,null,null,null,null,null,null,null,null,null,null,null,null,null,null,null,null,null,"H"]
["Interior","Floor 3","General",null,null,8,"Finish Walls & Painting",null,null,null,null,null,null,null,null,null,null,null,null,null,null,null,null,null,null,null,null,null,null,null,null,null,null,null,null,null,null,null,null,null,null,null,null,null,null,null,null,null,null,null,null,null,null,null,null,null,null,null,null,null,null,null,null,null,null,null,null,null,null,null,null,null,null,null,null,null,null,null,null,null,null,null,null,null,null,null,null,null,null,null,null,null,null,null,null,null,null,"H",null,null,null,null,null,null,null,null,null,null,null,null,null,null,null,null,null,null,null,null,null,null,null,null,"H",null,null,null,null,null,null,null,null,null,null,null,null,null,null,null,null,null,null,null,null,null,null,null,null,null,null,null,null,null,null,null,null,null,null,null,null,null,null,null,null,null,null,null,null,null,null,"H",null,null,null,null,null,null,null,null,null,null,null,null,null,null,null,null,null,null,null,null,null,null,null,null,null,null,null,null,null,null,null,null,null,null,null,null,null,null,null,null,null,null,null,null,null,null,null,null,null,null,null,null,null,"H","H","H","H",null,null,null,null,null,null,null,null,null,null,null,null,null,null,null,null,null,null,null,null,"H","H",null,null,null,null,null,null,null,null,null,null,null,null,null,null,null,null,null,null,null,null,null,null,null,null,null,null,null,null,null,null,null,null,null,null,null,null,null,null,null,null,null,null,null,null,null,null,null,null,null,null,null,null,null,null,null,null,null,null,null,null,null,null,null,null,null,null,null,null,null,null,null,null,null,null,null,null,null,null,null,null,null,null,null,null,null,null,null,null,null,null,null,null,null,null,null,null,null,null,null,null,null,null,null,null,null,null,null,null,"H",null,null,null,null,null,null,null,null,null,null,null,null,null,null,null,null,null,null,null,null,null,null,null,null,null,"H",null,null,null,null,null,null,null,null,null,null,null,null,null,null,null,null,null,null,null,null,null,null,null,null,null,null,null,null,null,null,null,null,null,null,null,null,null,null,null,null,null,null,null,null,"H"]
["Interior","Floor 3","General",null,null,9,"Painting & Install Ceiling Grid",null,null,null,null,null,null,null,null,null,null,null,null,null,null,null,null,null,null,null,null,null,null,null,null,null,null,null,null,null,null,null,null,null,null,null,null,null,null,null,null,null,null,null,null,null,null,null,null,null,null,null,null,null,null,null,null,null,null,null,null,null,null,null,null,null,null,null,null,null,null,null,null,null,null,null,null,null,null,null,null,null,null,null,null,null,null,null,null,null,null,"H",null,null,null,null,null,null,null,null,null,null,null,null,null,null,null,null,null,null,null,null,null,null,null,null,"H",null,null,null,null,null,null,null,null,null,null,null,null,null,null,null,null,null,null,null,null,null,null,null,null,null,null,null,null,null,null,null,null,null,null,null,null,null,null,null,null,null,null,null,null,null,null,"H",null,null,null,null,null,null,null,null,null,null,null,null,null,null,null,null,null,null,null,null,null,null,null,null,null,null,null,null,null,null,null,null,null,null,null,null,null,null,null,null,null,null,null,null,null,null,null,null,null,null,null,null,null,"H","H","H","H",null,null,null,null,null,null,null,null,null,null,null,null,null,null,null,null,null,null,null,null,"H","H",null,null,null,null,null,null,null,null,null,null,null,null,null,null,null,null,null,null,null,null,null,null,null,null,null,null,null,null,null,null,null,null,null,null,null,null,null,null,null,null,null,null,null,null,null,null,null,null,null,null,null,null,null,null,null,null,null,null,null,null,null,null,null,null,null,null,null,null,null,null,null,null,null,null,null,null,null,null,null,null,null,null,null,null,null,null,null,null,null,null,null,null,null,null,null,null,null,null,null,null,null,null,null,null,null,null,null,null,"H",null,null,null,null,null,null,null,null,null,null,null,null,null,null,null,null,null,null,null,null,null,null,null,null,null,"H",null,null,null,null,null,null,null,null,null,null,null,null,null,null,null,null,null,null,null,null,null,null,null,null,null,null,null,null,null,null,null,null,null,null,null,null,null,null,null,null,null,null,null,null,"H"]
["Interior","Floor 4","Zone A",null,null,10,"Install Electrical Fixtures & Mech Ceiling Drops",null,null,null,null,null,null,null,null,null,null,null,null,null,null,null,null,null,null,null,null,null,null,null,null,null,null,null,null,null,null,null,null,null,null,null,null,null,null,null,null,null,null,null,null,null,null,null,null,null,null,null,null,null,null,null,null,null,null,null,null,null,null,null,null,null,null,null,null,null,null,null,null,null,null,null,null,null,null,null,null,null,null,null,null,null,null,null,null,null,null,"H",null,null,null,null,null,null,null,null,null,null,null,null,null,null,null,null,null,null,null,null,null,null,null,null,"H",null,null,null,null,null,null,null,null,null,null,null,null,null,null,null,null,null,null,null,null,null,null,null,null,null,null,null,null,null,null,null,null,null,null,null,null,null,null,null,null,null,null,null,null,null,null,"H",null,null,null,null,null,null,null,null,null,null,null,null,null,null,null,null,null,null,null,null,null,null,null,null,null,null,null,null,null,null,null,null,null,null,null,null,null,null,null,null,null,null,null,null,null,null,null,null,null,null,null,null,null,"H","H","H","H",null,null,null,null,null,null,null,null,null,null,null,null,null,null,null,null,null,null,null,null,"H","H",null,null,null,null,null,null,null,null,null,null,null,null,null,null,null,null,null,null,null,null,null,null,null,null,null,null,null,null,null,null,null,null,null,null,null,null,null,null,null,null,null,null,null,null,null,null,null,null,null,null,null,null,null,null,null,"ZONE 4A",1,1,1,2,2,2,3,3,3,4,4,4,5,5,5,6,6,6,"B","B","B",7,7,7,8,8,8,"B","B","B",9,9,9,10,10,10,11,11,11,12,12,12,13,13,13,"B","B","B",14,14,14,15,"H",15,15,null,null,null,null,null,null,null,null,null,null,null,null,null,null,null,null,null,null,null,null,null,null,null,"H",null,null,null,null,null,null,null,null,null,null,null,null,null,null,null,null,null,null,null,null,null,null,null,null,null,null,null,null,null,null,null,null,null,null,null,null,null,null,null,null,null,null,null,null,"H"]
["Interior","Floor 4","Zone B",null,null,11,"Remaining Ceiling Drops & Install Casework",null,null,null,null,null,null,null,null,null,null,null,null,null,null,null,null,null,null,null,null,null,null,null,null,null,null,null,null,null,null,null,null,null,null,null,null,null,null,null,null,null,null,null,null,null,null,null,null,null,null,null,null,null,null,null,null,null,null,null,null,null,null,null,null,null,null,null,null,null,null,null,null,null,null,null,null,null,null,null,null,null,null,null,null,null,null,null,null,null,null,"H",null,null,null,null,null,null,null,null,null,null,null,null,null,null,null,null,null,null,null,null,null,null,null,null,"H",null,null,null,null,null,null,null,null,null,null,null,null,null,null,null,null,null,null,null,null,null,null,null,null,null,null,null,null,null,null,null,null,null,null,null,null,null,null,null,null,null,null,null,null,null,null,"H",null,null,null,null,null,null,null,null,null,null,null,null,null,null,null,null,null,null,null,null,null,null,null,null,null,null,null,null,null,null,null,null,null,null,null,null,null,null,null,null,null,null,null,null,null,null,null,null,null,null,null,null,null,"H","H","H","H",null,null,null,null,null,null,null,null,null,null,null,null,null,null,null,null,null,null,null,null,"H","H",null,null,null,null,null,null,null,null,null,null,null,null,null,null,null,null,null,null,null,null,null,null,null,null,null,null,null,null,null,null,null,null,null,null,null,null,null,null,null,null,null,null,null,null,null,null,null,null,null,null,null,null,null,null,null,null,null,null,"ZONE 4B",1,1,1,2,2,2,3,3,3,4,4,4,5,5,5,6,6,6,"B","B","B",7,7,7,8,8,8,"B","B","B",9,9,9,10,10,10,11,11,11,12,12,12,13,13,13,"B","B","B",14,"H",14,14,15,15,15,null,null,null,null,null,null,null,null,null,null,null,null,null,null,null,null,null,null,null,null,"H",null,null,null,null,null,null,null,null,null,null,null,null,null,null,null,null,null,null,null,null,null,null,null,null,null,null,null,null,null,null,null,null,null,null,null,null,null,null,null,null,null,null,null,null,"H"]
["Interior","Floor 4","Zone C",null,null,12,"Countertops, Millwork & Final Paint",null,null,null,null,null,null,null,null,null,null,null,null,null,null,null,null,null,null,null,null,null,null,null,null,null,null,null,null,null,null,null,null,null,null,null,null,null,null,null,null,null,null,null,null,null,null,null,null,null,null,null,null,null,null,null,null,null,null,null,null,null,null,null,null,null,null,null,null,null,null,null,null,null,null,null,null,null,null,null,null,null,null,null,null,null,null,null,null,null,null,"H",null,null,null,null,null,null,null,null,null,null,null,null,null,null,null,null,null,null,null,null,null,null,null,null,"H",null,null,null,null,null,null,null,null,null,null,null,null,null,null,null,null,null,null,null,null,null,null,null,null,null,null,null,null,null,null,null,null,null,null,null,null,null,null,null,null,null,null,null,null,null,null,"H",null,null,null,null,null,null,null,null,null,null,null,null,null,null,null,null,null,null,null,null,null,null,null,null,null,null,null,null,null,null,null,null,null,null,null,null,null,null,null,null,null,null,null,null,null,null,null,null,null,null,null,null,null,"H","H","H","H",null,null,null,null,null,null,null,null,null,null,null,null,null,null,null,null,null,null,null,null,"H","H",null,null,null,null,null,null,null,null,null,null,null,null,null,null,null,null,null,null,null,null,null,null,null,null,null,null,null,null,null,null,null,null,null,null,null,null,null,null,null,null,null,null,null,null,null,null,null,null,null,null,null,null,null,null,null,null,null,null,null,null,null,"ZONE 4C",1,1,1,2,2,2,3,3,3,4,4,4,5,5,5,6,6,6,"B","B","B",7,7,7,8,8,8,"B","B","B",9,9,9,10,10,10,11,11,11,12,12,12,13,13,13,"B","H","B","B",14,14,14,15,15,15,null,null,null,null,null,null,null,null,null,null,null,null,null,null,null,null,null,"H",null,null,null,null,null,null,null,null,null,null,null,null,null,null,null,null,null,null,null,null,null,null,null,null,null,null,null,null,null,null,null,null,null,null,null,null,null,null,null,null,null,null,null,null,"H"]
["Interior","Floor 4","Zone D",null,null,13,"Wall & Casework Fixtures, Ceiling Tiles & Flooring",null,null,null,null,null,null,null,null,null,null,null,null,null,null,null,null,null,null,null,null,null,null,null,null,null,null,null,null,null,null,null,null,null,null,null,null,null,null,null,null,null,null,null,null,null,null,null,null,null,null,null,null,null,null,null,null,null,null,null,null,null,null,null,null,null,null,null,null,null,null,null,null,null,null,null,null,null,null,null,null,null,null,null,null,null,null,null,null,null,null,"H",null,null,null,null,null,null,null,null,null,null,null,null,null,null,null,null,null,null,null,null,null,null,null,null,"H",null,null,null,null,null,null,null,null,null,null,null,null,null,null,null,null,null,null,null,null,null,null,null,null,null,null,null,null,null,null,null,null,null,null,null,null,null,null,null,null,null,null,null,null,null,null,"H",null,null,null,null,null,null,null,null,null,null,null,null,null,null,null,null,null,null,null,null,null,null,null,null,null,null,null,null,null,null,null,null,null,null,null,null,null,null,null,null,null,null,null,null,null,null,null,null,null,null,null,null,null,"H","H","H","H",null,null,null,null,null,null,null,null,null,null,null,null,null,null,null,null,null,null,null,null,"H","H",null,null,null,null,null,null,null,null,null,null,null,null,null,null,null,null,null,null,null,null,null,null,null,null,null,null,null,null,null,null,null,null,null,null,null,null,null,null,null,null,null,null,null,null,null,null,null,null,null,null,null,null,null,null,null,null,null,null,null,null,null,null,null,null,"ZONE 4D",1,1,1,2,2,2,3,3,3,4,4,4,5,5,5,6,6,6,"B","B","B",7,7,7,8,8,8,"B","B","B",9,9,9,10,10,10,11,11,11,12,12,12,13,"H",13,13,"B","B","B",14,14,14,15,15,15,null,null,null,null,null,null,null,null,null,null,null,null,null,null,"H",null,null,null,null,null,null,null,null,null,null,null,null,null,null,null,null,null,null,null,null,null,null,null,null,null,null,null,null,null,null,null,null,null,null,null,null,null,null,null,null,null,null,null,null,"H"]
["Interior","Floor 4","Zone E",null,null,14,"Flooring, Final Paint & 1st Clean",null,null,null,null,null,null,null,null,null,null,null,null,null,null,null,null,null,null,null,null,null,null,null,null,null,null,null,null,null,null,null,null,null,null,null,null,null,null,null,null,null,null,null,null,null,null,null,null,null,null,null,null,null,null,null,null,null,null,null,null,null,null,null,null,null,null,null,null,null,null,null,null,null,null,null,null,null,null,null,null,null,null,null,null,null,null,null,null,null,null,"H",null,null,null,null,null,null,null,null,null,null,null,null,null,null,null,null,null,null,null,null,null,null,null,null,"H",null,null,null,null,null,null,null,null,null,null,null,null,null,null,null,null,null,null,null,null,null,null,null,null,null,null,null,null,null,null,null,null,null,null,null,null,null,null,null,null,null,null,null,null,null,null,"H",null,null,null,null,null,null,null,null,null,null,null,null,null,null,null,null,null,null,null,null,null,null,null,null,null,null,null,null,null,null,null,null,null,null,null,null,null,null,null,null,null,null,null,null,null,null,null,null,null,null,null,null,null,"H","H","H","H",null,null,null,null,null,null,null,null,null,null,null,null,null,null,null,null,null,null,null,null,"H","H",null,null,null,null,null,null,null,null,null,null,null,null,null,null,null,null,null,null,null,null,null,null,null,null,null,null,null,null,null,null,null,null,null,null,null,null,null,null,null,null,null,null,null,null,null,null,null,null,null,null,null,null,null,null,null,null,null,null,null,null,null,null,null,null,null,null,null,"ZONE 4E",1,1,1,2,2,2,3,3,3,4,4,4,5,5,5,6,6,6,"B","B","B",7,7,7,8,8,8,"B","B","B",9,9,9,10,10,10,11,11,11,12,"H",12,12,13,13,13,"B","B","B",14,14,14,15,15,15,null,null,null,null,null,null,null,null,null,null,null,"H",null,null,null,null,null,null,null,null,null,null,null,null,null,null,null,null,null,null,null,null,null,null,null,null,null,null,null,null,null,null,null,null,null,null,null,null,null,null,null,null,null,null,null,null,"H"]
["Interior","Floor 4","Zone F",null,null,15,"Punchlist, Corrections & Final Clean",null,null,null,null,null,null,null,null,null,null,null,null,null,null,null,null,null,null,null,null,null,null,null,null,null,null,null,null,null,null,null,null,null,null,null,null,null,null,null,null,null,null,null,null,null,null,null,null,null,null,null,null,null,null,null,null,null,null,null,null,null,null,null,null,null,null,null,null,null,null,null,null,null,null,null,null,null,null,null,null,null,null,null,null,null,null,null,null,null,null,"H",null,null,null,null,null,null,null,null,null,null,null,null,null,null,null,null,null,null,null,null,null,null,null,null,"H",null,null,null,null,null,null,null,null,null,null,null,null,null,null,null,null,null,null,null,null,null,null,null,null,null,null,null,null,null,null,null,null,null,null,null,null,null,null,null,null,null,null,null,null,null,null,"H",null,null,null,null,null,null,null,null,null,null,null,null,null,null,null,null,null,null,null,null,null,null,null,null,null,null,null,null,null,null,null,null,null,null,null,null,null,null,null,null,null,null,null,null,null,null,null,null,null,null,null,null,null,"H","H","H","H",null,null,null,null,null,null,null,null,null,null,null,null,null,null,null,null,null,null,null,null,"H","H",null,null,null,null,null,null,null,null,null,null,null,null,null,null,null,null,null,null,null,null,null,null,null,null,null,null,null,null,null,null,null,null,null,null,null,null,null,null,null,null,null,null,null,null,null,null,null,null,null,null,null,null,null,null,null,null,null,null,null,null,null,null,null,null,null,null,null,null,null,null,"ZONE 4F",1,1,1,2,2,2,3,3,3,4,4,4,5,5,5,6,6,6,"B","B","B",7,7,7,8,8,8,"B","B","B",9,9,9,10,10,10,11,"H",11,11,12,12,12,13,13,13,"B","B","B",14,14,14,15,15,15,null,null,null,null,null,null,null,null,"H",null,null,null,null,null,null,null,null,null,null,null,null,null,null,null,null,null,null,null,null,null,null,null,null,null,null,null,null,null,null,null,null,null,null,null,null,null,null,null,null,null,null,null,null,"H"]
["Interior","Floor 4","Zone G",null,null,null,null,null,null,null,null,null,null,null,null,null,null,null,null,null,null,null,null,null,null,null,null,null,null,null,null,null,null,null,null,null,null,null,null,null,null,null,null,null,null,null,null,null,null,null,null,null,null,null,null,null,null,null,null,null,null,null,null,null,null,null,null,null,null,null,null,null,null,null,null,null,null,null,null,null,null,null,null,null,null,null,null,null,null,null,null,null,null,null,null,null,null,"H",null,null,null,null,null,null,null,null,null,null,null,null,null,null,null,null,null,null,null,null,null,null,null,null,"H",null,null,null,null,null,null,null,null,null,null,null,null,null,null,null,null,null,null,null,null,null,null,null,null,null,null,null,null,null,null,null,null,null,null,null,null,null,null,null,null,null,null,null,null,null,null,"H",null,null,null,null,null,null,null,null,null,null,null,null,null,null,null,null,null,null,null,null,null,null,null,null,null,null,null,null,null,null,null,null,null,null,null,null,null,null,null,null,null,null,null,null,null,null,null,null,null,null,null,null,null,"H","H","H","H",null,null,null,null,null,null,null,null,null,null,null,null,null,null,null,null,null,null,null,null,"H","H",null,null,null,null,null,null,null,null,null,null,null,null,null,null,null,null,null,null,null,null,null,null,null,null,null,null,null,null,null,null,null,null,null,null,null,null,null,null,null,null,null,null,null,null,null,null,null,null,null,null,null,null,null,null,null,null,null,null,null,null,null,null,null,null,null,null,null,null,null,null,null,null,null,"ZONE 4G",1,1,1,2,2,2,3,3,3,4,4,4,5,5,5,6,6,6,"B","B","B",7,7,7,8,8,8,"B","B","B",9,9,9,10,"H",10,10,11,11,11,12,12,12,13,13,13,"B","B","B",14,14,14,15,15,15,null,null,null,null,null,"H",null,null,null,null,null,null,null,null,null,null,null,null,null,null,null,null,null,null,null,null,null,null,null,null,null,null,null,null,null,null,null,null,null,null,null,null,null,null,null,null,null,null,null,null,"H"]
["Interior","Floor 4","Zone H",null,null,null,null,null,null,null,null,null,null,null,null,null,null,null,null,null,null,null,null,null,null,null,null,null,null,null,null,null,null,null,null,null,null,null,null,null,null,null,null,null,null,null,null,null,null,null,null,null,null,null,null,null,null,null,null,null,null,null,null,null,null,null,null,null,null,null,null,null,null,null,null,null,null,null,null,null,null,null,null,null,null,null,null,null,null,null,null,null,null,null,null,null,null,"H",null,null,null,null,null,null,null,null,null,null,null,null,null,null,null,null,null,null,null,null,null,null,null,null,"H",null,null,null,null,null,null,null,null,null,null,null,null,null,null,null,null,null,null,null,null,null,null,null,null,null,null,null,null,null,null,null,null,null,null,null,null,null,null,null,null,null,null,null,null,null,null,"H",null,null,null,null,null,null,null,null,null,null,null,null,null,null,null,null,null,null,null,null,null,null,null,null,null,null,null,null,null,null,null,null,null,null,null,null,null,null,null,null,null,null,null,null,null,null,null,null,null,null,null,null,null,"H","H","H","H",null,null,null,null,null,null,null,null,null,null,null,null,null,null,null,null,null,null,null,null,"H","H",null,null,null,null,null,null,null,null,null,null,null,null,null,null,null,null,null,null,null,null,null,null,null,null,null,null,null,null,null,null,null,null,null,null,null,null,null,null,null,null,null,null,null,null,null,null,null,null,null,null,null,null,null,null,null,null,null,null,null,null,null,null,null,null,null,null,null,null,null,null,null,null,null,null,null,null,"ZONE 4H",1,1,1,2,2,2,3,3,3,4,4,4,5,5,5,6,6,6,"B","B","B",7,7,7,8,8,8,"B","B","B",9,"H",9,9,10,10,10,11,11,11,12,12,12,13,13,13,"B","B","B",14,14,14,15,15,15,null,null,"H",null,null,null,null,null,null,null,null,null,null,null,null,null,null,null,null,null,null,null,null,null,null,null,null,null,null,null,null,null,null,null,null,null,null,null,null,null,null,null,null,null,null,null,null,"H"]
["Interior","Floor 4","Zone I",null,null,null,null,null,null,null,null,null,null,null,null,null,null,null,null,null,null,null,null,null,null,null,null,null,null,null,null,null,null,null,null,null,null,null,null,null,null,null,null,null,null,null,null,null,null,null,null,null,null,null,null,null,null,null,null,null,null,null,null,null,null,null,null,null,null,null,null,null,null,null,null,null,null,null,null,null,null,null,null,null,null,null,null,null,null,null,null,null,null,null,null,null,null,"H",null,null,null,null,null,null,null,null,null,null,null,null,null,null,null,null,null,null,null,null,null,null,null,null,"H",null,null,null,null,null,null,null,null,null,null,null,null,null,null,null,null,null,null,null,null,null,null,null,null,null,null,null,null,null,null,null,null,null,null,null,null,null,null,null,null,null,null,null,null,null,null,"H",null,null,null,null,null,null,null,null,null,null,null,null,null,null,null,null,null,null,null,null,null,null,null,null,null,null,null,null,null,null,null,null,null,null,null,null,null,null,null,null,null,null,null,null,null,null,null,null,null,null,null,null,null,"H","H","H","H",null,null,null,null,null,null,null,null,null,null,null,null,null,null,null,null,null,null,null,null,"H","H",null,null,null,null,null,null,null,null,null,null,null,null,null,null,null,null,null,null,null,null,null,null,null,null,null,null,null,null,null,null,null,null,null,null,null,null,null,null,null,null,null,null,null,null,null,null,null,null,null,null,null,null,null,null,null,null,null,null,null,null,null,null,null,null,null,null,null,null,null,null,null,null,null,null,null,null,null,null,null,"ZONE 4I",1,1,1,2,2,2,3,3,3,4,4,4,5,5,5,6,6,6,"B","B","B",7,7,7,8,8,8,"B","H","B","B",9,9,9,10,10,10,11,11,11,12,12,12,13,13,13,"B","B","B",14,14,14,15,15,"H",15,null,null,null,null,null,null,null,null,null,null,null,null,null,null,null,null,null,null,null,null,null,null,null,null,null,null,null,null,null,null,null,null,null,null,null,null,null,null,null,null,null,null,null,"H"]
["Interior","Floor 4","General",null,null,null,null,null,null,null,null,null,null,null,null,null,null,null,null,null,null,null,null,null,null,null,null,null,null,null,null,null,null,null,null,null,null,null,null,null,null,null,null,null,null,null,null,null,null,null,null,null,null,null,null,null,null,null,null,null,null,null,null,null,null,null,null,null,null,null,null,null,null,null,null,null,null,null,null,null,null,null,null,null,null,null,null,null,null,null,null,null,null,null,null,null,null,"H",null,null,null,null,null,null,null,null,null,null,null,null,null,null,null,null,null,null,null,null,null,null,null,null,"H",null,null,null,null,null,null,null,null,null,null,null,null,null,null,null,null,null,null,null,null,null,null,null,null,null,null,null,null,null,null,null,null,null,null,null,null,null,null,null,null,null,null,null,null,null,null,"H",null,null,null,null,null,null,null,null,null,null,null,null,null,null,null,null,null,null,null,null,null,null,null,null,null,null,null,null,null,null,null,null,null,null,null,null,null,null,null,null,null,null,null,null,null,null,null,null,null,null,null,null,null,"H","H","H","H",null,null,null,null,null,null,null,null,null,null,null,null,null,null,null,null,null,null,null,null,"H","H",null,null,null,null,null,null,null,null,null,null,null,null,null,null,null,null,null,null,null,null,null,null,null,null,null,null,null,null,null,null,null,null,null,null,null,null,null,null,null,null,null,null,null,null,null,null,null,null,null,null,null,null,null,null,null,null,null,null,null,null,null,null,null,null,null,null,null,null,null,null,null,null,null,null,null,null,null,null,null,null,null,null,null,null,null,null,null,null,null,null,null,null,null,null,null,null,null,null,null,null,null,null,null,null,null,null,null,null,"H",null,null,null,null,null,null,null,null,null,null,null,null,null,null,null,null,null,null,null,null,null,null,null,null,null,"H",null,null,null,null,null,null,null,null,null,null,null,null,null,null,null,null,null,null,null,null,null,null,null,null,null,null,null,null,null,null,null,null,null,null,null,null,null,null,null,null,null,null,null,null,"H"]
["Interior","Floor 4","General",null,null,"COMMISSIONING LEGEND",null,null,null,null,null,null,null,null,null,null,null,null,null,null,null,null,null,null,null,null,null,null,null,null,null,null,null,null,null,null,null,null,null,null,null,null,null,null,null,null,null,null,null,null,null,null,null,null,null,null,null,null,null,null,null,null,null,null,null,null,null,null,null,null,null,null,null,null,null,null,null,null,null,null,null,null,null,null,null,null,null,null,null,null,null,null,null,null,null,null,null,"H",null,null,null,null,null,null,null,null,null,null,null,null,null,null,null,null,null,null,null,null,null,null,null,null,"H",null,null,null,null,null,null,null,null,null,null,null,null,null,null,null,null,null,null,null,null,null,null,null,null,null,null,null,null,null,null,null,null,null,null,null,null,null,null,null,null,null,null,null,null,null,null,"H",null,null,null,null,null,null,null,null,null,null,null,null,null,null,null,null,null,null,null,null,null,null,null,null,null,null,null,null,null,null,null,null,null,null,null,null,null,null,null,null,null,null,null,null,null,null,null,null,null,null,null,null,null,"H","H","H","H",null,null,null,null,null,null,null,null,null,null,null,null,null,null,null,null,null,null,null,null,"H","H",null,null,null,null,null,null,null,null,null,null,null,null,null,null,null,null,null,null,null,null,null,null,null,null,null,null,null,null,null,null,null,null,null,null,null,null,null,null,null,null,null,null,null,null,null,null,null,null,null,null,null,null,null,null,null,null,null,null,null,null,null,null,null,null,null,null,null,null,null,null,null,null,null,null,null,null,null,null,null,null,null,null,null,null,null,null,null,null,null,null,null,null,null,null,null,null,null,null,null,null,null,null,null,null,null,null,null,null,"H",null,null,null,null,null,null,null,null,null,null,null,null,null,null,null,null,null,null,null,null,null,null,null,null,null,"H",null,null,null,null,null,null,null,null,null,null,null,null,null,null,null,null,null,null,null,null,null,null,null,null,null,null,null,null,null,null,null,null,null,null,null,null,null,null,null,null,null,null,null,null,"H"]
["Interior","Floor 5","Zone A",null,null,16,"Set AHU",null,null,null,null,null,null,null,null,null,null,null,null,null,null,null,null,null,null,null,null,null,null,null,null,null,null,null,null,null,null,null,null,null,null,null,null,null,null,null,null,null,null,null,null,null,null,null,null,null,null,null,null,null,null,null,null,null,null,null,null,null,null,null,null,null,null,null,null,null,null,null,null,null,null,null,null,null,null,null,null,null,null,null,null,null,null,null,null,null,null,"H",null,null,null,null,null,null,null,null,null,null,null,null,null,null,null,null,null,null,null,null,null,null,null,null,"H",null,null,null,null,null,null,null,null,null,null,null,null,null,null,null,null,null,null,null,null,null,null,null,null,null,null,null,null,null,null,null,null,null,null,null,null,null,null,null,null,null,null,null,null,null,null,"H",null,null,null,null,null,null,null,null,null,null,null,null,null,null,null,null,null,null,null,null,null,null,null,null,null,null,null,null,null,null,null,null,null,null,null,null,null,null,null,null,null,null,null,null,null,null,null,null,null,null,null,null,null,"H","H","H","H",null,null,null,null,null,null,null,null,null,null,null,null,null,null,null,null,null,null,null,null,"H","H",null,null,null,null,null,null,null,null,null,null,null,null,null,null,null,null,null,null,null,null,null,null,null,null,null,null,null,null,null,null,null,null,null,null,null,null,null,null,null,null,null,null,null,null,null,null,null,null,null,null,null,null,null,null,null,null,null,null,null,null,null,null,null,null,null,null,null,null,null,null,null,null,null,null,null,null,null,null,null,null,null,null,"ZONE 5A",1,1,1,2,2,2,3,3,3,4,4,4,5,5,5,6,6,6,"B","B","B",7,7,7,8,"H",8,8,"B","B","B",9,9,9,10,10,10,11,11,11,12,12,12,13,13,13,"B","B","B",14,14,"H",14,15,15,15,null,null,null,null,null,null,null,null,null,null,null,null,null,null,null,null,null,null,null,null,null,null,null,null,null,null,null,null,null,null,null,null,null,null,null,null,null,null,null,null,"H"]
["Interior","Floor 5","Zone B",null,null,17,"Mechanical Installation",null,null,null,null,null,null,null,null,null,null,null,null,null,null,null,null,null,null,null,null,null,null,null,null,null,null,null,null,null,null,null,null,null,null,null,null,null,null,null,null,null,null,null,null,null,null,null,null,null,null,null,null,null,null,null,null,null,null,null,null,null,null,null,null,null,null,null,null,null,null,null,null,null,null,null,null,null,null,null,null,null,null,null,null,null,null,null,null,null,null,"H",null,null,null,null,null,null,null,null,null,null,null,null,null,null,null,null,null,null,null,null,null,null,null,null,"H",null,null,null,null,null,null,null,null,null,null,null,null,null,null,null,null,null,null,null,null,null,null,null,null,null,null,null,null,null,null,null,null,null,null,null,null,null,null,null,null,null,null,null,null,null,null,"H",null,null,null,null,null,null,null,null,null,null,null,null,null,null,null,null,null,null,null,null,null,null,null,null,null,null,null,null,null,null,null,null,null,null,null,null,null,null,null,null,null,null,null,null,null,null,null,null,null,null,null,null,null,"H","H","H","H",null,null,null,null,null,null,null,null,null,null,null,null,null,null,null,null,null,null,null,null,"H","H",null,null,null,null,null,null,null,null,null,null,null,null,null,null,null,null,null,null,null,null,null,null,null,null,null,null,null,null,null,null,null,null,null,null,null,null,null,null,null,null,null,null,null,null,null,null,null,null,null,null,null,null,null,null,null,null,null,null,null,null,null,null,null,null,null,null,null,null,null,null,null,null,null,null,null,null,null,null,null,null,null,null,null,null,null,"ZONE 5B",1,1,1,2,2,2,3,3,3,4,4,4,5,5,5,6,6,6,"B","B","B",7,"H",7,7,8,8,8,"B","B","B",9,9,9,10,10,10,11,11,11,12,12,12,13,13,13,"B","B","H","B",14,14,14,15,15,15,"B","B",null,null,null,null,null,null,null,null,null,null,null,null,null,null,null,null,null,null,null,null,null,null,null,null,null,null,null,null,null,null,null,null,null,null,null,"H"]
["Cx","General","General",null,null,18,"Controls",null,null,null,null,null,null,null,null,null,null,null,null,null,null,null,null,null,null,null,null,null,null,null,null,null,null,null,null,null,null,null,null,null,null,null,null,null,null,null,null,null,null,null,null,null,null,null,null,null,null,null,null,null,null,null,null,null,null,null,null,null,null,null,null,null,null,null,null,null,null,null,null,null,null,null,null,null,null,null,null,null,null,null,null,null,null,null,null,null,null,"H",null,null,null,null,null,null,null,null,null,null,null,null,null,null,null,null,null,null,null,null,null,null,null,null,"H",null,null,null,null,null,null,null,null,null,null,null,null,null,null,null,null,null,null,null,null,null,null,null,null,null,null,null,null,null,null,null,null,null,null,null,null,null,null,null,null,null,null,null,null,null,null,"H",null,null,null,null,null,null,null,null,null,null,null,null,null,null,null,null,null,null,null,null,null,null,null,null,null,null,null,null,null,null,null,null,null,null,null,null,null,null,null,null,null,null,null,null,null,null,null,null,null,null,null,null,null,"H","H","H","H",null,null,null,null,null,null,null,null,null,null,null,null,null,null,null,null,null,null,null,null,"H","H",null,null,null,null,null,null,null,null,null,null,null,null,null,null,null,null,null,null,null,null,null,null,null,null,null,null,null,null,null,null,null,null,null,null,null,null,null,null,null,null,null,null,null,null,null,null,null,null,null,null,null,null,null,null,null,null,null,null,null,null,null,null,null,null,null,null,null,null,null,null,null,null,null,null,null,null,null,null,null,null,null,null,null,null,null,null,null,null,null,null,null,null,null,null,null,null,null,null,null,null,null,null,null,null,null,null,null,null,"H",null,null,null,null,null,null,null,null,null,null,null,null,null,null,null,null,null,null,null,null,null,null,null,null,null,"H",null,null,null,null,null,null,null,null,null,null,null,null,null,null,null,null,null,null,null,null,null,null,null,null,null,null,null,null,null,null,null,null,null,null,null,null,null,null,null,null,null,null,null,null,"H"]
["Cx","General","General",null,null,19,"Point to Point",null,null,null,null,null,null,null,null,null,null,null,null,null,null,null,null,null,null,null,null,null,null,null,null,null,null,null,null,null,null,null,null,null,null,null,null,null,null,null,null,null,null,null,null,null,null,null,null,null,null,null,null,null,null,null,null,null,null,null,null,null,null,null,null,null,null,null,null,null,null,null,null,null,null,null,null,null,null,null,null,null,null,null,null,null,null,null,null,null,null,"H",null,null,null,null,null,null,null,null,null,null,null,null,null,null,null,null,null,null,null,null,null,null,null,null,"H",null,null,null,null,null,null,null,null,null,null,null,null,null,null,null,null,null,null,null,null,null,null,null,null,null,null,null,null,null,null,null,null,null,null,null,null,null,null,null,null,null,null,null,null,null,null,"H",null,null,null,null,null,null,null,null,null,null,null,null,null,null,null,null,null,null,null,null,null,null,null,null,null,null,null,null,null,null,null,null,null,null,null,null,null,null,null,null,null,null,null,null,null,null,null,null,null,null,null,null,null,"H","H","H","H",null,null,null,null,null,null,null,null,null,null,null,null,null,null,null,null,null,null,null,null,"H","H",null,null,null,null,null,null,null,null,null,null,null,null,null,null,null,null,null,null,null,null,null,null,null,null,null,null,null,null,null,null,null,null,null,null,null,null,null,null,null,null,null,null,null,null,null,null,null,null,null,null,null,null,null,null,null,null,null,null,null,null,null,null,null,null,null,null,null,null,null,null,null,null,null,null,null,null,null,null,null,null,null,null,null,null,null,null,null,null,null,null,null,null,null,null,null,null,null,null,null,null,null,null,null,null,null,null,null,null,"H",null,null,null,null,null,null,null,null,null,null,null,null,null,null,null,null,null,null,null,null,null,null,null,null,null,"H",null,null,null,null,null,null,null,null,null,null,null,null,null,null,null,null,null,null,null,null,null,null,null,null,null,null,null,null,null,null,null,null,null,null,null,null,null,null,null,null,null,null,null,null,"H"]
["Cx","General","General",null,null,20,"Mech Startup",null,null,null,null,null,null,null,null,null,null,null,null,null,null,null,null,null,null,null,null,null,null,null,null,null,null,null,null,null,null,null,null,null,null,null,null,null,null,null,null,null,null,null,null,null,null,null,null,null,null,null,null,null,null,null,null,null,null,null,null,null,null,null,null,null,null,null,null,null,null,null,null,null,null,null,null,null,null,null,null,null,null,null,null,null,null,null,null,null,null,"H",null,null,null,null,null,null,null,null,null,null,null,null,null,null,null,null,null,null,null,null,null,null,null,null,"H",null,null,null,null,null,null,null,null,null,null,null,null,null,null,null,null,null,null,null,null,null,null,null,null,null,null,null,null,null,null,null,null,null,null,null,null,null,null,null,null,null,null,null,null,null,null,"H",null,null,null,null,null,null,null,null,null,null,null,null,null,null,null,null,null,null,null,null,null,null,null,null,null,null,null,null,null,null,null,null,null,null,null,null,null,null,null,null,null,null,null,null,null,null,null,null,null,null,null,null,null,"H","H","H","H",null,null,null,null,null,null,null,null,null,null,null,null,null,null,null,null,null,null,null,null,"H","H",null,null,null,null,null,null,null,null,null,null,null,null,null,null,null,null,null,null,null,null,null,null,null,null,null,null,null,null,null,null,null,null,null,null,null,null,null,null,null,null,null,null,null,null,null,null,null,null,null,null,null,null,null,null,null,null,null,null,null,null,null,null,null,null,null,null,null,null,null,null,null,null,null,null,null,null,null,null,null,null,null,null,null,null,null,null,null,null,null,null,null,null,null,null,null,null,null,null,null,null,null,null,null,null,null,null,null,null,"H",null,null,null,null,null,null,null,null,null,null,null,null,null,null,null,null,null,null,null,null,null,null,null,null,null,"H",null,null,null,null,null,null,null,null,null,null,null,null,null,null,null,null,null,null,null,null,null,null,null,null,null,null,null,null,null,null,null,null,null,null,null,null,null,null,null,null,null,null,null,null,"H"]
["Cx","General","General",null,null,21,"Pre-functional Checklists",null,null,null,null,null,null,null,null,null,null,null,null,null,null,null,null,null,null,null,null,null,null,null,null,null,null,null,null,null,null,null,null,null,null,null,null,null,null,null,null,null,null,null,null,null,null,null,null,null,null,null,null,null,null,null,null,null,null,null,null,null,null,null,null,null,null,null,null,null,null,null,null,null,null,null,null,null,null,null,null,null,null,null,null,null,null,null,null,null,null,"H",null,null,null,null,null,null,null,null,null,null,null,null,null,null,null,null,null,null,null,null,null,null,null,null,"H",null,null,null,null,null,null,null,null,null,null,null,null,null,null,null,null,null,null,null,null,null,null,null,null,null,null,null,null,null,null,null,null,null,null,null,null,null,null,null,null,null,null,null,null,null,null,"H",null,null,null,null,null,null,null,null,null,null,null,null,null,null,null,null,null,null,null,null,null,null,null,null,null,null,null,null,null,null,null,null,null,null,null,null,null,null,null,null,null,null,null,null,null,null,null,null,null,null,null,null,null,"H","H","H","H",null,null,null,null,null,null,null,null,null,null,null,null,null,null,null,null,null,null,null,null,"H","H",null,null,null,null,null,null,null,null,null,null,null,null,null,null,null,null,null,null,null,null,null,null,null,null,null,null,null,null,null,null,null,null,null,null,null,null,null,null,null,null,null,null,null,16,16,16,16,16,null,null,null,null,null,null,null,null,null,null,null,null,null,null,null,null,null,null,null,null,null,null,null,null,null,null,null,null,null,null,null,null,null,null,null,null,null,null,null,null,null,null,null,null,null,null,null,null,null,null,null,null,null,null,null,null,null,null,null,null,"H",null,null,null,null,null,null,null,null,21,21,21,21,21,21,21,21,21,21,21,21,21,21,21,21,21,"H",21,21,21,21,21,21,21,21,21,21,21,21,null,null,null,null,null,null,null,null,null,null,null,null,null,null,null,null,null,null,null,null,null,null,null,null,null,null,null,null,null,null,null,null,"H"]
["Cx","General","General",null,null,22,"Controls",null,null,null,null,null,null,null,null,null,null,null,null,null,null,null,null,null,null,null,null,null,null,null,null,null,null,null,null,null,null,null,null,null,null,null,null,null,null,null,null,null,null,null,null,null,null,null,null,null,null,null,null,null,null,null,null,null,null,null,null,null,null,null,null,null,null,null,null,null,null,null,null,null,null,null,null,null,null,null,null,null,null,null,null,null,null,null,null,null,null,"H",null,null,null,null,null,null,null,null,null,null,null,null,null,null,null,null,null,null,null,null,null,null,null,null,"H",null,null,null,null,null,null,null,null,null,null,null,null,null,null,null,null,null,null,null,null,null,null,null,null,null,null,null,null,null,null,null,null,null,null,null,null,null,null,null,null,null,null,null,null,null,null,"H",null,null,null,null,null,null,null,null,null,null,null,null,null,null,null,null,null,null,null,null,null,null,null,null,null,null,null,null,null,null,null,null,null,null,null,null,null,null,null,null,null,null,null,null,null,null,null,null,null,null,null,null,null,"H","H","H","H",null,null,null,null,null,null,null,null,null,null,null,null,null,null,null,null,null,null,null,null,"H","H",null,null,null,null,null,null,null,null,null,null,null,null,null,null,null,null,null,null,null,null,null,null,null,null,null,null,null,null,null,null,null,null,null,null,null,null,null,null,null,null,null,null,null,null,null,null,null,null,17,17,17,17,17,17,17,17,17,17,null,null,null,null,null,null,null,null,null,null,null,null,null,null,null,null,null,null,null,null,null,null,null,null,null,null,null,null,null,null,null,null,null,null,null,null,null,null,null,null,null,null,null,null,null,null,null,null,null,null,"H",null,null,null,null,null,null,null,null,null,null,null,null,null,null,null,null,null,null,null,22,22,22,22,22,22,"H",22,22,22,22,22,22,22,22,22,22,22,22,22,22,null,null,null,null,null,null,null,null,null,null,null,null,null,null,null,null,null,null,null,null,null,null,null,null,null,null,null,null,null,null,"H"]
["Cx","General","General",null,null,23,"TAB",null,null,null,null,null,null,null,null,null,null,null,null,null,null,null,null,null,null,null,null,null,null,null,null,null,null,null,null,null,null,null,null,null,null,null,null,null,null,null,null,null,null,null,null,null,null,null,null,null,null,null,null,null,null,null,null,null,null,null,null,null,null,null,null,null,null,null,null,null,null,null,null,null,null,null,null,null,null,null,null,null,null,null,null,null,null,null,null,null,null,"H",null,null,null,null,null,null,null,null,null,null,null,null,null,null,null,null,null,null,null,null,null,null,null,null,"H",null,null,null,null,null,null,null,null,null,null,null,null,null,null,null,null,null,null,null,null,null,null,null,null,null,null,null,null,null,null,null,null,null,null,null,null,null,null,null,null,null,null,null,null,null,null,"H",null,null,null,null,null,null,null,null,null,null,null,null,null,null,null,null,null,null,null,null,null,null,null,null,null,null,null,null,null,null,null,null,null,null,null,null,null,null,null,null,null,null,null,null,null,null,null,null,null,null,null,null,null,"H","H","H","H",null,null,null,null,null,null,null,null,null,null,null,null,null,null,null,null,null,null,null,null,"H","H",null,null,null,null,null,null,null,null,null,null,null,null,null,null,null,null,null,null,null,null,null,null,null,null,null,null,null,null,null,null,null,null,null,null,null,null,null,null,null,null,null,null,null,null,null,null,null,null,null,null,null,null,null,null,null,null,null,null,18,18,18,18,18,18,18,18,18,18,null,null,null,null,null,null,null,null,null,null,null,null,null,null,null,null,null,null,null,null,null,null,null,null,null,null,null,null,null,null,null,null,null,null,null,null,null,null,null,null,"H",null,null,null,null,null,null,null,null,null,null,null,null,null,null,null,null,null,null,null,null,null,null,null,null,null,"H",null,null,null,null,null,null,null,null,null,23,23,23,23,23,23,23,23,23,23,null,null,null,null,null,null,null,null,null,null,null,null,null,null,null,null,null,null,null,null,null,null,null,null,null,"H"]
["Cx","General","General",null,null,24,"Cx + FA Testing",null,null,null,null,null,null,null,null,null,null,null,null,null,null,null,null,null,null,null,null,null,null,null,null,null,null,null,null,null,null,null,null,null,null,null,null,null,null,null,null,null,null,null,null,null,null,null,null,null,null,null,null,null,null,null,null,null,null,null,null,null,null,null,null,null,null,null,null,null,null,null,null,null,null,null,null,null,null,null,null,null,null,null,null,null,null,null,null,null,null,"H",null,null,null,null,null,null,null,null,null,null,null,null,null,null,null,null,null,null,null,null,null,null,null,null,"H",null,null,null,null,null,null,null,null,null,null,null,null,null,null,null,null,null,null,null,null,null,null,null,null,null,null,null,null,null,null,null,null,null,null,null,null,null,null,null,null,null,null,null,null,null,null,"H",null,null,null,null,null,null,null,null,null,null,null,null,null,null,null,null,null,null,null,null,null,null,null,null,null,null,null,null,null,null,null,null,null,null,null,null,null,null,null,null,null,null,null,null,null,null,null,null,null,null,null,null,null,"H","H","H","H",null,null,null,null,null,null,null,null,null,null,null,null,null,null,null,null,null,null,null,null,"H","H",null,null,null,null,null,null,null,null,null,null,null,null,null,null,null,null,null,null,null,null,null,null,null,null,null,null,null,null,null,null,null,null,null,null,null,null,null,null,null,null,null,null,null,null,null,null,null,null,null,null,null,null,null,null,null,null,null,null,null,null,null,null,null,null,null,null,null,null,19,19,19,19,19,19,19,19,19,19,null,null,null,null,null,null,null,null,null,null,null,null,null,null,null,null,null,null,null,null,null,null,null,null,null,null,null,null,null,null,"H",null,null,null,null,null,null,null,null,null,null,null,null,null,null,null,null,null,null,null,null,null,null,null,null,null,"H",null,null,null,null,null,null,null,null,null,null,null,null,null,null,null,null,null,null,24,24,24,24,24,24,24,24,24,24,"B","B","B","B","B","B","B","B","B","B",null,null,null,null,null,null,"H"]
["Cx","General","General",null,null,25,"LS/ FA Testing",null,null,null,null,null,null,null,null,null,null,null,null,null,null,null,null,null,null,null,null,null,null,null,null,null,null,null,null,null,null,null,null,null,null,null,null,null,null,null,null,null,null,null,null,null,null,null,null,null,null,null,null,null,null,null,null,null,null,null,null,null,null,null,null,null,null,null,null,null,null,null,null,null,null,null,null,null,null,null,null,null,null,null,null,null,null,null,null,null,null,"H",null,null,null,null,null,null,null,null,null,null,null,null,null,null,null,null,null,null,null,null,null,null,null,null,"H",null,null,null,null,null,null,null,null,null,null,null,null,null,null,null,null,null,null,null,null,null,null,null,null,null,null,null,null,null,null,null,null,null,null,null,null,null,null,null,null,null,null,null,null,null,null,"H",null,null,null,null,null,null,null,null,null,null,null,null,null,null,null,null,null,null,null,null,null,null,null,null,null,null,null,null,null,null,null,null,null,null,null,null,null,null,null,null,null,null,null,null,null,null,null,null,null,null,null,null,null,"H","H","H","H",null,null,null,null,null,null,null,null,null,null,null,null,null,null,null,null,null,null,null,null,"H","H",null,null,null,null,null,null,null,null,null,null,null,null,null,null,null,null,null,null,null,null,null,null,null,null,null,null,null,null,null,null,null,null,null,null,null,null,null,null,null,null,null,null,null,null,null,null,null,null,null,null,null,null,null,null,null,null,null,null,null,null,null,null,null,null,null,null,null,null,null,null,null,null,null,null,null,null,null,null,20,20,20,20,20,null,null,null,null,null,null,null,null,null,null,null,null,null,null,null,null,null,null,null,null,null,null,null,null,null,"H",null,null,null,null,null,null,null,null,null,null,null,null,null,null,null,null,null,null,null,null,null,null,null,null,null,"H",null,null,null,null,null,null,null,null,null,null,null,null,null,null,null,null,null,null,25,25,25,25,25,25,25,25,25,25,null,null,null,null,null,null,null,null,null,null,null,null,null,null,null,null,"H"]
["Exterior","All","All",null,null,26,"Functional Performance Testing",null,null,null,null,null,null,null,null,null,null,null,null,null,null,null,null,null,null,null,null,null,null,null,null,null,null,null,null,null,null,null,null,null,null,null,null,null,null,null,null,null,null,null,null,null,null,null,null,null,null,null,null,null,null,null,null,null,null,null,null,null,null,null,null,null,null,null,null,null,null,null,null,null,null,null,null,null,null,null,null,null,null,null,null,null,null,null,null,null,null,"H",null,null,null,null,null,null,null,null,null,null,null,null,null,null,null,null,null,null,null,null,null,null,null,null,"H",null,null,null,null,null,null,null,null,null,null,null,null,null,null,null,null,null,null,null,null,null,null,null,null,null,null,null,null,null,null,null,null,null,null,null,null,null,null,null,null,null,null,null,null,null,null,"H",null,null,null,null,null,null,null,null,null,null,null,null,null,null,null,null,null,null,null,null,null,null,null,null,null,null,null,null,null,null,null,null,null,null,null,null,null,null,null,null,null,null,null,null,null,null,null,null,null,null,null,null,null,"H","H","H","H",null,null,null,null,null,null,null,null,null,null,null,null,null,null,null,null,null,null,null,null,"H","H",null,null,null,null,null,null,null,null,null,null,null,null,null,null,null,null,null,null,null,null,null,null,null,null,null,null,null,null,null,null,null,null,null,null,null,null,null,null,null,null,null,null,null,null,null,null,null,null,null,null,null,null,null,null,null,null,null,null,null,null,null,null,null,null,null,null,null,null,null,null,null,null,null,null,null,null,null,null,null,null,null,null,null,null,null,null,null,null,null,null,null,null,null,null,null,null,null,null,null,null,null,null,null,null,null,null,null,null,"H",null,null,null,null,null,null,null,null,null,null,null,null,null,null,null,null,null,null,null,null,null,null,null,null,null,"H",null,null,null,null,null,null,null,null,null,null,null,null,null,null,null,null,null,null,null,null,null,null,null,null,null,null,null,null,26,26,26,26,26,26,26,26,26,26,26,26,26,26,26,26,"H",26,26,26,"B","B","B","B","B","B","B","B","B","B"]
["Exterior","All","All",null,null,null,null,null,null,null,null,null,null,null,null,null,null,null,null,null,null,null,null,null,null,null,null,null,null,null,null,null,null,null,null,null,null,null,null,null,null,null,null,null,null,null,null,null,null,null,null,null,null,null,null,null,null,null,null,null,null,null,null,null,null,null,null,null,null,null,null,null,null,null,null,null,null,null,null,null,null,null,null,null,null,null,null,null,null,null,null,null,null,null,null,null,null,"H",null,null,null,null,null,null,null,null,null,null,null,null,null,null,null,null,null,null,null,null,null,null,null,null,"H",null,null,null,null,null,null,null,null,null,null,null,null,null,null,null,null,null,null,null,null,null,null,null,null,null,null,null,null,null,null,null,null,null,null,null,null,null,null,null,null,null,null,null,null,null,null,"H",null,null,null,null,null,null,null,null,null,null,null,null,null,null,null,null,null,null,null,null,null,null,null,null,null,null,null,null,"B","B","B","B","B","B","B","B","B",null,null,null,null,null,null,null,null,null,null,null,null,null,null,null,null,"H","H","H","H",null,null,null,null,null,null,null,null,null,null,null,null,null,null,null,null,null,null,null,null,"H","H",null,null,null,null,null,null,null,null,null,null,null,null,null,null,null,null,null,null,null,null,null,null,null,null,null,null,null,null,null,null,null,null,null,null,null,null,null,null,null,null,null,null,null,null,null,null,null,null,null,null,null,null,null,null,null,null,null,null,null,null,null,null,null,null,null,null,null,null,null,null,null,null,null,null,null,null,null,null,null,null,null,null,null,null,null,null,null,null,null,null,null,null,null,null,null,null,null,null,null,null,null,null,null,null,null,null,null,null,"H",null,null,null,null,null,null,null,null,null,null,null,null,null,null,null,null,null,null,null,null,null,null,null,null,null,"H",null,null,null,null,null,null,null,null,null,null,null,null,null,null,null,null,null,null,null,null,null,null,null,null,null,null,null,null,null,null,null,null,null,null,null,null,null,null,null,null,null,null,null,null,"H"]
["Exterior","East","A",null,null,null,null,null,null,null,null,null,null,null,null,null,null,null,null,null,null,null,null,null,null,null,null,null,null,null,null,null,null,null,null,null,null,null,null,null,null,null,null,null,null,null,null,null,null,null,null,null,null,null,null,null,null,null,null,null,null,null,null,null,null,null,null,null,null,null,null,null,null,null,null,null,null,null,null,null,null,null,null,null,null,null,null,null,null,null,null,null,null,null,null,null,null,"H",null,null,null,null,null,null,null,null,null,null,null,null,null,null,null,null,null,null,null,null,null,null,null,null,"H",null,null,null,null,null,null,null,null,null,null,null,null,null,null,null,null,null,null,null,null,null,null,null,null,null,null,null,null,null,null,null,null,null,null,null,null,null,null,null,null,null,null,null,null,null,null,"H",null,null,null,null,null,null,null,null,null,null,null,null,null,null,null,null,null,null,null,null,null,null,null,null,null,null,null,null,null,null,null,null,null,null,null,null,"EAST A","A","A","A","A","A","B","B","B","B","B","B","B","B","B","B","C","H","H","H","H","C","C","C","C","D","D","D","D","D","E","E","E","E","E",null,null,null,null,null,null,"H","H",null,null,null,null,null,null,null,null,null,null,null,null,null,null,null,null,null,null,null,null,null,null,null,null,null,null,null,null,null,null,null,null,null,null,null,null,null,null,null,null,null,null,null,null,null,null,null,null,null,null,null,null,null,null,null,null,null,null,null,null,null,null,null,null,null,null,null,null,null,null,null,null,null,null,null,null,null,null,null,null,null,null,null,null,null,null,null,null,null,null,null,null,null,null,null,null,null,null,null,null,null,null,null,null,null,null,null,null,"H",null,null,null,null,null,null,null,null,null,null,null,null,null,null,null,null,null,null,null,null,null,null,null,null,null,"H",null,null,null,null,null,null,null,null,null,null,null,null,null,null,null,null,null,null,null,null,null,null,null,null,null,null,null,null,null,null,null,null,null,null,null,null,null,null,null,null,null,null,null,null,"H"]
["Exterior","East","B",null,null,null,null,null,null,null,null,null,null,null,null,null,null,null,null,null,null,null,null,null,null,null,null,null,null,null,null,null,null,null,null,null,null,null,null,null,null,null,null,null,null,null,null,null,null,null,null,null,null,null,null,null,null,null,null,null,null,null,null,null,null,null,null,null,null,null,null,null,null,null,null,null,null,null,null,null,null,null,null,null,null,null,null,null,null,null,null,null,null,null,null,null,null,"H",null,null,null,null,null,null,null,null,null,null,null,null,null,null,null,null,null,null,null,null,null,null,null,null,"H",null,null,null,null,null,null,null,null,null,null,null,null,null,null,null,null,null,null,null,null,null,null,null,null,null,null,null,null,null,null,null,null,null,null,null,null,null,null,null,null,null,null,null,null,null,null,"H",null,null,null,null,null,null,null,null,null,null,null,null,null,null,null,null,null,null,null,null,null,null,null,null,null,null,null,null,null,null,null,null,null,null,null,null,null,null,null,null,null,"EAST B","A","A","A","A","A","B","B","B","B","B","B","H","H","H","H","B","B","B","B","C","C","C","C","C","D","D","D","D","D","E","E","E","E","E",null,"H","H",null,null,null,null,null,null,null,null,null,null,null,null,null,null,null,null,null,null,null,null,null,null,null,null,null,null,null,null,null,null,null,null,null,null,null,null,null,null,null,null,null,null,null,null,null,null,null,null,null,null,null,null,null,null,null,null,null,null,null,null,null,null,null,null,null,null,null,null,null,null,null,null,null,null,null,null,null,null,null,null,null,null,null,null,null,null,null,null,null,null,null,null,null,null,null,null,null,null,null,null,null,null,null,null,null,null,null,null,"H",null,null,null,null,null,null,null,null,null,null,null,null,null,null,null,null,null,null,null,null,null,null,null,null,null,"H",null,null,null,null,null,null,null,null,null,null,null,null,null,null,null,null,null,null,null,null,null,null,null,null,null,null,null,null,null,null,null,null,null,null,null,null,null,null,null,null,null,null,null,null,"H"]
["Exterior","East","C",null,null,null,null,null,null,null,null,null,null,null,null,null,null,null,null,null,null,null,null,null,null,null,null,null,null,null,null,null,null,null,null,null,null,null,null,null,null,null,null,null,null,null,null,null,null,null,null,null,null,null,null,null,null,null,null,null,null,null,null,null,null,null,null,null,null,null,null,null,null,null,null,null,null,null,null,null,null,null,null,null,null,null,null,null,null,null,null,null,null,null,null,null,null,"H",null,null,null,null,null,null,null,null,null,null,null,null,null,null,null,null,null,null,null,null,null,null,null,null,"H",null,null,null,null,null,null,null,null,null,null,null,null,null,null,null,null,null,null,null,null,null,null,null,null,null,null,null,null,null,null,null,null,null,null,null,null,null,null,null,null,null,null,null,null,null,null,"H",null,null,null,null,null,null,null,null,null,null,null,null,null,null,null,null,null,null,null,null,null,null,null,null,null,null,null,null,null,null,null,null,null,null,null,null,null,null,null,null,null,null,null,null,null,null,"EAST C","A","A","A","A","A","B","H","H","H","H","B","B","B","B","B","B","B","B","B","C","C","C","C","C","D","D","D","D","D","E","H","H","E","E","E","E",null,null,null,null,null,null,null,null,null,null,null,null,null,null,null,null,null,null,null,null,null,null,null,null,null,null,null,null,null,null,null,null,null,null,null,null,null,null,null,null,null,null,null,null,null,null,null,null,null,null,null,null,null,null,null,null,null,null,null,null,null,null,null,null,null,null,null,null,null,null,null,null,null,null,null,null,null,null,null,null,null,null,null,null,null,null,null,null,null,null,null,null,null,null,null,null,null,null,null,null,null,null,null,null,"H",null,null,null,null,null,null,null,null,null,null,null,null,null,null,null,null,null,null,null,null,null,null,null,null,null,"H",null,null,null,null,null,null,null,null,null,null,null,null,null,null,null,null,null,null,null,null,null,null,null,null,null,null,null,null,null,null,null,null,null,null,null,null,null,null,null,null,null,null,null,null,"H"]
["Exterior","East","D",null,null,"EXTERIOR LEGEND",null,null,null,null,null,null,null,null,null,null,null,null,null,null,null,null,null,null,null,null,null,null,null,null,null,null,null,null,null,null,null,null,null,null,null,null,null,null,null,null,null,null,null,null,null,null,null,null,null,null,null,null,null,null,null,null,null,null,null,null,null,null,null,null,null,null,null,null,null,null,null,null,null,null,null,null,null,null,null,null,null,null,null,null,null,null,null,null,null,null,null,"H",null,null,null,null,null,null,null,null,null,null,null,null,null,null,null,null,null,null,null,null,null,null,null,null,"H",null,null,null,null,null,null,null,null,null,null,null,null,null,null,null,null,null,null,null,null,null,null,null,null,null,null,null,null,null,null,null,null,null,null,null,null,null,null,null,null,null,null,null,null,null,null,"H",null,null,null,null,null,null,null,null,null,null,null,null,null,null,null,null,null,null,null,null,null,null,null,null,null,null,null,null,null,null,null,null,null,null,null,null,null,null,null,null,null,null,null,null,null,null,null,null,null,null,null,"EAST D","A","H","H","H","H","A","A","A","A","B","B","B","B","B","B","B","B","B","B","C","C","C","C","C","D","H","H","D","D","D","D","E","E","E","E","E",null,null,null,null,null,null,null,null,null,null,null,null,null,null,null,null,null,null,null,null,null,null,null,null,null,null,null,null,null,null,null,null,null,null,null,null,null,null,null,null,null,null,null,null,null,null,null,null,null,null,null,null,null,null,null,null,null,null,null,null,null,null,null,null,null,null,null,null,null,null,null,null,null,null,null,null,null,null,null,null,null,null,null,null,null,null,null,null,null,null,null,null,null,null,null,null,null,null,null,"H",null,null,null,null,null,null,null,null,null,null,null,null,null,null,null,null,null,null,null,null,null,null,null,null,null,"H",null,null,null,null,null,null,null,null,null,null,null,null,null,null,null,null,null,null,null,null,null,null,null,null,null,null,null,null,null,null,null,null,null,null,null,null,null,null,null,null,null,null,null,null,"H"]
["Exterior","South","A",null,null,"A","Structural Steel Supports",null,null,null,null,null,null,null,null,null,null,null,null,null,null,null,null,null,null,null,null,null,null,null,null,null,null,null,null,null,null,null,null,null,null,null,null,null,null,null,null,null,null,null,null,null,null,null,null,null,null,null,null,null,null,null,null,null,null,null,null,null,null,null,null,null,null,null,null,null,null,null,null,null,null,null,null,null,null,null,null,null,null,null,null,null,null,null,null,null,null,"H",null,null,null,null,null,null,null,null,null,null,null,null,null,null,null,null,null,null,null,null,null,null,null,null,"H",null,null,null,null,null,null,null,null,null,null,null,null,null,null,null,null,null,null,null,null,null,null,null,null,null,null,null,null,null,null,null,null,null,null,null,null,null,null,null,null,null,null,null,null,null,null,"H",null,null,null,null,null,null,null,null,null,null,null,null,null,null,null,null,null,null,null,null,null,null,null,null,null,null,null,null,null,null,null,null,null,null,null,null,null,null,null,null,null,null,null,null,null,null,null,null,null,null,null,null,null,"H","H","H","H",null,null,null,"SOUTH A","A","A","A","A","A","B","B","B","B","B","B","B","B","B","B","C","H","H","C","C","C","C","D","D","D","D","D","E","E","E","E","E",null,null,null,null,null,null,null,null,null,null,null,null,null,null,null,null,null,null,null,null,null,null,null,null,null,null,null,null,null,null,null,null,null,null,null,null,null,null,null,null,null,null,null,null,null,null,null,null,null,null,null,null,null,null,null,null,null,null,null,null,null,null,null,null,null,null,null,null,null,null,null,null,null,null,null,null,null,null,null,null,null,null,null,null,null,null,null,null,null,null,null,null,null,null,"H",null,null,null,null,null,null,null,null,null,null,null,null,null,null,null,null,null,null,null,null,null,null,null,null,null,"H",null,null,null,null,null,null,null,null,null,null,null,null,null,null,null,null,null,null,null,null,null,null,null,null,null,null,null,null,null,null,null,null,null,null,null,null,null,null,null,null,null,null,null,null,"H"]
["Exterior","South","B",null,null,"B","Framing & Sheathing",null,null,null,null,null,null,null,null,null,null,null,null,null,null,null,null,null,null,null,null,null,null,null,null,null,null,null,null,null,null,null,null,null,null,null,null,null,null,null,null,null,null,null,null,null,null,null,null,null,null,null,null,null,null,null,null,null,null,null,null,null,null,null,null,null,null,null,null,null,null,null,null,null,null,null,null,null,null,null,null,null,null,null,null,null,null,null,null,null,null,"H",null,null,null,null,null,null,null,null,null,null,null,null,null,null,null,null,null,null,null,null,null,null,null,null,"H",null,null,null,null,null,null,null,null,null,null,null,null,null,null,null,null,null,null,null,null,null,null,null,null,null,null,null,null,null,null,null,null,null,null,null,null,null,null,null,null,null,null,null,null,null,null,"H",null,null,null,null,null,null,null,null,null,null,null,null,null,null,null,null,null,null,null,null,null,null,null,null,null,null,null,null,null,null,null,null,null,null,null,null,null,null,null,null,null,null,null,null,null,null,null,null,null,null,null,null,null,"H","H","H","H",null,null,null,null,null,null,null,null,"SOUTH B","A","A","A","A","A","B","B","B","B","B","B","H","H","B","B","B","B","C","C","C","C","C","D","D","D","D","D","E","E","E","E","E",null,null,null,null,null,null,null,null,null,null,null,null,null,null,null,null,null,null,null,null,null,null,null,null,null,null,null,null,null,null,null,null,null,null,null,null,null,null,null,null,null,null,null,null,null,null,null,null,null,null,null,null,null,null,null,null,null,null,null,null,null,null,null,null,null,null,null,null,null,null,null,null,null,null,null,null,null,null,null,null,null,null,null,null,null,null,null,null,null,"H",null,null,null,null,null,null,null,null,null,null,null,null,null,null,null,null,null,null,null,null,null,null,null,null,null,"H",null,null,null,null,null,null,null,null,null,null,null,null,null,null,null,null,null,null,null,null,null,null,null,null,null,null,null,null,null,null,null,null,null,null,null,null,null,null,null,null,null,null,null,null,"H"]
["Exterior","South","C",null,null,"C","EIFS",null,null,null,null,null,null,null,null,null,null,null,null,null,null,null,null,null,null,null,null,null,null,null,null,null,null,null,null,null,null,null,null,null,null,null,null,null,null,null,null,null,null,null,null,null,null,null,null,null,null,null,null,null,null,null,null,null,null,null,null,null,null,null,null,null,null,null,null,null,null,null,null,null,null,null,null,null,null,null,null,null,null,null,null,null,null,null,null,null,null,"H",null,null,null,null,null,null,null,null,null,null,null,null,null,null,null,null,null,null,null,null,null,null,null,null,"H",null,null,null,null,null,null,null,null,null,null,null,null,null,null,null,null,null,null,null,null,null,null,null,null,null,null,null,null,null,null,null,null,null,null,null,null,null,null,null,null,null,null,null,null,null,null,"H",null,null,null,null,null,null,null,null,null,null,null,null,null,null,null,null,null,null,null,null,null,null,null,null,null,null,null,null,null,null,null,null,null,null,null,null,null,null,null,null,null,null,null,null,null,null,null,null,null,null,null,null,null,"H","H","H","H",null,null,null,null,null,null,null,null,null,null,null,null,null,"SOUTH C","A","A","A","A","A","B","H","H","B","B","B","B","B","B","B","B","B","C","C","C","C","C","D","D","D","D","D","E","E","E","E","E","B","B","B","B","B",null,null,null,null,null,null,null,null,null,null,null,null,null,null,null,null,null,null,null,null,null,null,null,null,null,null,null,null,null,null,null,null,null,null,null,null,null,null,null,null,null,null,null,null,null,null,null,null,null,null,null,null,null,null,null,null,null,null,null,null,null,null,null,null,null,null,null,null,null,null,null,null,null,null,null,null,null,null,null,"H",null,null,null,null,null,null,null,null,null,null,null,null,null,null,null,null,null,null,null,null,null,null,null,null,null,"H",null,null,null,null,null,null,null,null,null,null,null,null,null,null,null,null,null,null,null,null,null,null,null,null,null,null,null,null,null,null,null,null,null,null,null,null,null,null,null,null,null,null,null,null,"H"]
["Exterior","South","D",null,null,"D","Window Installation",null,null,null,null,null,null,null,null,null,null,null,null,null,null,null,null,null,null,null,null,null,null,null,null,null,null,null,null,null,null,null,null,null,null,null,null,null,null,null,null,null,null,null,null,null,null,null,null,null,null,null,null,null,null,null,null,null,null,null,null,null,null,null,null,null,null,null,null,null,null,null,null,null,null,null,null,null,null,null,null,null,null,null,null,null,null,null,null,null,null,"H",null,null,null,null,null,null,null,null,null,null,null,null,null,null,null,null,null,null,null,null,null,null,null,null,"H",null,null,null,null,null,null,null,null,null,null,null,null,null,null,null,null,null,null,null,null,null,null,null,null,null,null,null,null,null,null,null,null,null,null,null,null,null,null,null,null,null,null,null,null,null,null,"H",null,null,null,null,null,null,null,null,null,null,null,null,null,null,null,null,null,null,null,null,null,null,null,null,null,null,null,null,null,null,null,null,null,null,null,null,null,null,null,null,null,null,null,null,null,null,null,null,null,null,null,null,null,"H","H","H","H",null,null,null,null,null,null,null,null,null,null,null,null,null,null,null,null,null,null,"SOUTH D","A","H","H","A","A","A","A","B","B","B","B","B","B","B","B","B","B","C","C","C","C","C","D","D","D","D","D","E","E","E","E","E",null,null,null,null,null,null,null,null,null,null,null,null,null,null,null,null,null,null,null,null,null,null,null,null,null,null,null,null,null,null,null,null,null,null,null,null,null,null,null,null,null,null,null,null,null,null,null,null,null,null,null,null,null,null,null,null,null,null,null,null,null,null,null,null,null,null,null,null,null,null,null,null,null,null,null,null,null,null,null,"H",null,null,null,null,null,null,null,null,null,null,null,null,null,null,null,null,null,null,null,null,null,null,null,null,null,"H",null,null,null,null,null,null,null,null,null,null,null,null,null,null,null,null,null,null,null,null,null,null,null,null,null,null,null,null,null,null,null,null,null,null,null,null,null,null,null,null,null,null,null,null,"H"]
["Exterior","West","A",null,null,"E","Final Caulking & Finishes",null,null,null,null,null,null,null,null,null,null,null,null,null,null,null,null,null,null,null,null,null,null,null,null,null,null,null,null,null,null,null,null,null,null,null,null,null,null,null,null,null,null,null,null,null,null,null,null,null,null,null,null,null,null,null,null,null,null,null,null,null,null,null,null,null,null,null,null,null,null,null,null,null,null,null,null,null,null,null,null,null,null,null,null,null,null,null,null,null,null,"H",null,null,null,null,null,null,null,null,null,null,null,null,null,null,null,null,null,null,null,null,null,null,null,null,"H",null,null,null,null,null,null,null,null,null,null,null,null,null,null,null,null,null,null,null,null,null,null,null,null,null,null,null,null,null,null,null,null,null,null,null,null,null,null,null,null,null,null,null,null,null,null,"H",null,null,null,null,null,null,null,null,null,null,null,null,null,null,null,null,null,null,null,null,null,null,null,null,null,null,null,null,null,null,null,null,null,null,null,null,null,null,null,null,null,null,null,null,null,null,null,null,null,null,null,null,null,"H","H","H","H",null,null,null,null,null,null,null,null,null,null,null,null,null,null,null,null,null,null,null,null,"H","H",null,null,null,"WEST A","A","A","A","A","A","B","B","B","B","B","B","B","B","B","B","C","C","C","C","C","D","D","D","D","D","E","E","E","E","E",null,null,null,null,null,null,null,null,null,null,null,null,null,null,null,null,null,null,null,null,null,null,null,null,null,null,null,null,null,null,null,null,null,null,null,null,null,null,null,null,null,null,null,null,null,null,null,null,null,null,null,null,null,null,null,null,null,null,null,null,null,null,null,null,null,null,null,null,null,null,null,null,null,null,"H",null,null,null,null,null,null,null,null,null,null,null,null,null,null,null,null,null,null,null,null,null,null,null,null,null,"H",null,null,null,null,null,null,null,null,null,null,null,null,null,null,null,null,null,null,null,null,null,null,null,null,null,null,null,null,null,null,null,null,null,null,null,null,null,null,null,null,null,null,null,null,"H"]
["Exterior","West","B",null,null,"F","Shade Structure",null,null,null,null,null,null,null,null,null,null,null,null,null,null,null,null,null,null,null,null,null,null,null,null,null,null,null,null,null,null,null,null,null,null,null,null,null,null,null,null,null,null,null,null,null,null,null,null,null,null,null,null,null,null,null,null,null,null,null,null,null,null,null,null,null,null,null,null,null,null,null,null,null,null,null,null,null,null,null,null,null,null,null,null,null,null,null,null,null,null,"H",null,null,null,null,null,null,null,null,null,null,null,null,null,null,null,null,null,null,null,null,null,null,null,null,"H",null,null,null,null,null,null,null,null,null,null,null,null,null,null,null,null,null,null,null,null,null,null,null,null,null,null,null,null,null,null,null,null,null,null,null,null,null,null,null,null,null,null,null,null,null,null,"H",null,null,null,null,null,null,null,null,null,null,null,null,null,null,null,null,null,null,null,null,null,null,null,null,null,null,null,null,null,null,null,null,null,null,null,null,null,null,null,null,null,null,null,null,null,null,null,null,null,null,null,null,null,"H","H","H","H",null,null,null,null,null,null,null,null,null,null,null,null,null,null,null,null,null,null,null,null,"H","H",null,null,null,null,null,null,null,null,"WEST B","A","A","A","A","A","B","B","B","B","B","B","B","B","B","B","C","C","C","C","C","D","D","D","D","D","E","E","E","E","E",null,null,null,null,null,null,null,null,null,null,null,null,null,null,null,null,null,null,null,null,null,null,null,null,null,null,null,null,null,null,null,null,null,null,null,null,null,null,null,null,null,null,null,null,null,null,null,null,null,null,null,null,null,null,null,null,null,null,null,null,null,null,null,null,null,null,null,null,null,"H",null,null,null,null,null,null,null,null,null,null,null,null,null,null,null,null,null,null,null,null,null,null,null,null,null,"H",null,null,null,null,null,null,null,null,null,null,null,null,null,null,null,null,null,null,null,null,null,null,null,null,null,null,null,null,null,null,null,null,null,null,null,null,null,null,null,null,null,null,null,null,"H"]
["Exterior","West","C",null,null,null,null,null,null,null,null,null,null,null,null,null,null,null,null,null,null,null,null,null,null,null,null,null,null,null,null,null,null,null,null,null,null,null,null,null,null,null,null,null,null,null,null,null,null,null,null,null,null,null,null,null,null,null,null,null,null,null,null,null,null,null,null,null,null,null,null,null,null,null,null,null,null,null,null,null,null,null,null,null,null,null,null,null,null,null,null,null,null,null,null,null,null,"H",null,null,null,null,null,null,null,null,null,null,null,null,null,null,null,null,null,null,null,null,null,null,null,null,"H",null,null,null,null,null,null,null,null,null,null,null,null,null,null,null,null,null,null,null,null,null,null,null,null,null,null,null,null,null,null,null,null,null,null,null,null,null,null,null,null,null,null,null,null,null,null,"H",null,null,null,null,null,null,null,null,null,null,null,null,null,null,null,null,null,null,null,null,null,null,null,null,null,null,null,null,null,null,null,null,null,null,null,null,null,null,null,null,null,null,null,null,null,null,null,null,null,null,null,null,null,"H","H","H","H",null,null,null,null,null,null,null,null,null,null,null,null,null,null,null,null,null,null,null,null,"H","H",null,null,null,null,null,null,null,null,null,null,null,null,null,"WEST C","A","A","A","A","A","B","B","B","B","B","B","B","B","B","B","C","C","C","C","C","D","D","D","D","D","E","E","E","E","E",null,null,null,null,null,null,null,null,null,null,null,null,null,null,null,null,null,null,null,null,null,null,null,null,null,null,null,null,null,null,null,null,null,null,null,null,null,null,null,null,null,null,null,null,null,null,null,null,null,null,null,null,null,null,null,null,null,null,null,null,null,null,null,null,"H",null,null,null,null,null,null,null,null,null,null,null,null,null,null,null,null,null,null,null,null,null,null,null,null,null,"H",null,null,null,null,null,null,null,null,null,null,null,null,null,null,null,null,null,null,null,null,null,null,null,null,null,null,null,null,null,null,null,null,null,null,null,null,null,null,null,null,null,null,null,null,"H"]
["Exterior","West","D",null,null,null,null,null,null,null,null,null,null,null,null,null,null,null,null,null,null,null,null,null,null,null,null,null,null,null,null,null,null,null,null,null,null,null,null,null,null,null,null,null,null,null,null,null,null,null,null,null,null,null,null,null,null,null,null,null,null,null,null,null,null,null,null,null,null,null,null,null,null,null,null,null,null,null,null,null,null,null,null,null,null,null,null,null,null,null,null,null,null,null,null,null,null,"H",null,null,null,null,null,null,null,null,null,null,null,null,null,null,null,null,null,null,null,null,null,null,null,null,"H",null,null,null,null,null,null,null,null,null,null,null,null,null,null,null,null,null,null,null,null,null,null,null,null,null,null,null,null,null,null,null,null,null,null,null,null,null,null,null,null,null,null,null,null,null,null,"H",null,null,null,null,null,null,null,null,null,null,null,null,null,null,null,null,null,null,null,null,null,null,null,null,null,null,null,null,null,null,null,null,null,null,null,null,null,null,null,null,null,null,null,null,null,null,null,null,null,null,null,null,null,"H","H","H","H",null,null,null,null,null,null,null,null,null,null,null,null,null,null,null,null,null,null,null,null,"H","H",null,null,null,null,null,null,null,null,null,null,null,null,null,null,null,null,null,null,"WEST D","A","A","A","A","A","B","B","B","B","B","B","B","B","B","B","C","C","C","C","C","D","D","D","D","D","E","E","E","E","E",null,null,null,null,null,null,null,null,null,null,null,null,null,null,null,null,null,null,null,null,null,null,null,null,null,null,null,null,null,null,null,null,null,null,null,null,null,null,null,null,null,null,null,null,null,null,null,null,null,null,null,null,null,null,null,null,null,null,null,"H",null,null,null,null,null,null,null,null,null,null,null,null,null,null,null,null,null,null,null,null,null,null,null,null,null,"H",null,null,null,null,null,null,null,null,null,null,null,null,null,null,null,null,null,null,null,null,null,null,null,null,null,null,null,null,null,null,null,null,null,null,null,null,null,null,null,null,null,null,null,null,"H"]
["Exterior","North","A",null,null,null,null,null,null,null,null,null,null,null,null,null,null,null,null,null,null,null,null,null,null,null,null,null,null,null,null,null,null,null,null,null,null,null,null,null,null,null,null,null,null,null,null,null,null,null,null,null,null,null,null,null,null,null,null,null,null,null,null,null,null,null,null,null,null,null,null,null,null,null,null,null,null,null,null,null,null,null,null,null,null,null,null,null,null,null,null,null,null,null,null,null,null,"H",null,null,null,null,null,null,null,null,null,null,null,null,null,null,null,null,null,null,null,null,null,null,null,null,"H",null,null,null,null,null,null,null,null,null,null,null,null,null,null,null,null,null,null,null,null,null,null,null,null,null,null,null,null,null,null,null,null,null,null,null,null,null,null,null,null,null,null,null,null,null,null,"H",null,null,null,null,null,null,null,null,null,null,null,null,null,null,null,null,null,null,null,null,null,null,null,null,null,null,null,null,null,null,null,null,null,null,null,null,null,null,null,null,null,null,null,null,null,null,null,null,null,null,null,null,null,"H","H","H","H",null,null,null,null,null,null,null,null,null,null,null,null,null,null,null,null,null,null,null,null,"H","H",null,null,null,null,null,null,null,null,null,null,null,null,null,null,null,null,null,null,null,null,null,null,null,"NORTH A","A","A","A","A","A","B","B","B","B","B","B","B","B","B","B","C","C","C","C","C","D","D","D","D","D","E","E","E","E","E",null,null,null,null,null,null,null,null,null,null,null,null,null,null,null,null,null,null,null,null,null,null,null,null,null,null,null,null,null,null,null,null,null,null,null,null,null,null,null,null,null,null,null,null,null,null,null,null,null,null,null,null,null,null,"H",null,null,null,null,null,null,null,null,null,null,null,null,null,null,null,null,null,null,null,null,null,null,null,null,null,"H",null,null,null,null,null,null,null,null,null,null,null,null,null,null,null,null,null,null,null,null,null,null,null,null,null,null,null,null,null,null,null,null,null,null,null,null,null,null,null,null,null,null,null,null,"H"]
["Exterior","North","B",null,null,null,null,null,null,null,null,null,null,null,null,null,null,null,null,null,null,null,null,null,null,null,null,null,null,null,null,null,null,null,null,null,null,null,null,null,null,null,null,null,null,null,null,null,null,null,null,null,null,null,null,null,null,null,null,null,null,null,null,null,null,null,null,null,null,null,null,null,null,null,null,null,null,null,null,null,null,null,null,null,null,null,null,null,null,null,null,null,null,null,null,null,null,"H",null,null,null,null,null,null,null,null,null,null,null,null,null,null,null,null,null,null,null,null,null,null,null,null,"H",null,null,null,null,null,null,null,null,null,null,null,null,null,null,null,null,null,null,null,null,null,null,null,null,null,null,null,null,null,null,null,null,null,null,null,null,null,null,null,null,null,null,null,null,null,null,"H",null,null,null,null,null,null,null,null,null,null,null,null,null,null,null,null,null,null,null,null,null,null,null,null,null,null,null,null,null,null,null,null,null,null,null,null,null,null,null,null,null,null,null,null,null,null,null,null,null,null,null,null,null,"H","H","H","H",null,null,null,null,null,null,null,null,null,null,null,null,null,null,null,null,null,null,null,null,"H","H",null,null,null,null,null,null,null,null,null,null,null,null,null,null,null,null,null,null,null,null,null,null,null,null,null,null,null,null,"NORTH B","A","A","A","A","A","B","B","B","B","B","B","B","B","B","B","C","C","C","C","C","D","D","D","D","D","E","E","E","E","E",null,null,null,null,null,null,null,null,null,null,null,null,null,null,null,null,null,null,null,null,null,null,null,null,null,null,null,null,null,null,null,null,null,null,null,null,null,null,null,null,null,null,null,null,null,null,null,null,null,"H",null,null,null,null,null,null,null,null,null,null,null,null,null,null,null,null,null,null,null,null,null,null,null,null,null,"H",null,null,null,null,null,null,null,null,null,null,null,null,null,null,null,null,null,null,null,null,null,null,null,null,null,null,null,null,null,null,null,null,null,null,null,null,null,null,null,null,null,null,null,null,"H"]
["Exterior","North","C",null,null,"FINISHING SITEWORK LEGEND",null,null,null,null,null,null,null,null,null,null,null,null,null,null,null,null,null,null,null,null,null,null,null,null,null,null,null,null,null,null,null,null,null,null,null,null,null,null,null,null,null,null,null,null,null,null,null,null,null,null,null,null,null,null,null,null,null,null,null,null,null,null,null,null,null,null,null,null,null,null,null,null,null,null,null,null,null,null,null,null,null,null,null,null,null,null,null,null,null,null,null,"H",null,null,null,null,null,null,null,null,null,null,null,null,null,null,null,null,null,null,null,null,null,null,null,null,"H",null,null,null,null,null,null,null,null,null,null,null,null,null,null,null,null,null,null,null,null,null,null,null,null,null,null,null,null,null,null,null,null,null,null,null,null,null,null,null,null,null,null,null,null,null,null,"H",null,null,null,null,null,null,null,null,null,null,null,null,null,null,null,null,null,null,null,null,null,null,null,null,null,null,null,null,null,null,null,null,null,null,null,null,null,null,null,null,null,null,null,null,null,null,null,null,null,null,null,null,null,"H","H","H","H",null,null,null,null,null,null,null,null,null,null,null,null,null,null,null,null,null,null,null,null,"H","H",null,null,null,null,null,null,null,null,null,null,null,null,null,null,null,null,null,null,null,null,null,null,null,null,null,null,null,null,null,null,null,null,null,"NORTH C","A","A","A","A","A","B","B","B","B","B","B","B","B","B","B","C","C","C","C","C","D","D","D","D","D","E","E","E","E","E",null,null,null,null,null,null,null,null,null,null,null,null,null,null,null,null,null,null,null,null,null,null,null,null,null,null,null,null,null,null,null,null,null,null,null,null,null,null,null,null,null,null,null,null,"H",null,null,null,null,null,null,null,null,null,null,null,null,null,null,null,null,null,null,null,null,null,null,null,null,null,"H",null,null,null,null,null,null,null,null,null,null,null,null,null,null,null,null,null,null,null,null,null,null,null,null,null,null,null,null,null,null,null,null,null,null,null,null,null,null,null,null,null,null,null,null,"H"]
["Exterior","North","D",null,null,1,"Site Demoblization",null,null,null,null,null,null,null,null,null,null,null,null,null,null,null,null,null,null,null,null,null,null,null,null,null,null,null,null,null,null,null,null,null,null,null,null,null,null,null,null,null,null,null,null,null,null,null,null,null,null,null,null,null,null,null,null,null,null,null,null,null,null,null,null,null,null,null,null,null,null,null,null,null,null,null,null,null,null,null,null,null,null,null,null,null,null,null,null,null,null,"H",null,null,null,null,null,null,null,null,null,null,null,null,null,null,null,null,null,null,null,null,null,null,null,null,"H",null,null,null,null,null,null,null,null,null,null,null,null,null,null,null,null,null,null,null,null,null,null,null,null,null,null,null,null,null,null,null,null,null,null,null,null,null,null,null,null,null,null,null,null,null,null,"H",null,null,null,null,null,null,null,null,null,null,null,null,null,null,null,null,null,null,null,null,null,null,null,null,null,null,null,null,null,null,null,null,null,null,null,null,null,null,null,null,null,null,null,null,null,null,null,null,null,null,null,null,null,"H","H","H","H",null,null,null,null,null,null,null,null,null,null,null,null,null,null,null,null,null,null,null,null,"H","H",null,null,null,null,null,null,null,null,null,null,null,null,null,null,null,null,null,null,null,null,null,null,null,null,null,null,null,null,null,null,null,null,null,null,null,null,null,null,"NORTH D","A","A","A","A","A","B","B","B","B","B","B","B","B","B","B","C","C","C","C","C","D","D","D","D","D","E","E","E","E","E",null,null,null,null,null,null,null,null,null,null,null,null,null,null,null,null,null,null,null,null,null,null,null,null,null,null,null,null,null,null,null,null,null,null,null,null,null,null,null,"H",null,null,null,null,null,null,null,null,null,null,null,null,null,null,null,null,null,null,null,null,null,null,null,null,null,"H",null,null,null,null,null,null,null,null,null,null,null,null,null,null,null,null,null,null,null,null,null,null,null,null,null,null,null,null,null,null,null,null,null,null,null,null,null,null,null,null,null,null,null,null,"H"]
["Exterior","All","All",null,null,2,"UG Electrical",null,null,null,null,null,null,null,null,null,null,null,null,null,null,null,null,null,null,null,null,null,null,null,null,null,null,null,null,null,null,null,null,null,null,null,null,null,null,null,null,null,null,null,null,null,null,null,null,null,null,null,null,null,null,null,null,null,null,null,null,null,null,null,null,null,null,null,null,null,null,null,null,null,null,null,null,null,null,null,null,null,null,null,null,null,null,null,null,null,null,"H",null,null,null,null,null,null,null,null,null,null,null,null,null,null,null,null,null,null,null,null,null,null,null,null,"H",null,null,null,null,null,null,null,null,null,null,null,null,null,null,null,null,null,null,null,null,null,null,null,null,null,null,null,null,null,null,null,null,null,null,null,null,null,null,null,null,null,null,null,null,null,null,"H",null,null,null,null,null,null,null,null,null,null,null,null,null,null,null,null,null,null,null,null,null,null,null,null,null,null,null,null,null,null,null,null,null,null,null,null,null,null,null,null,null,null,null,null,null,null,null,null,null,null,null,null,null,"H","H","H","H",null,null,null,null,null,null,null,null,null,null,null,null,null,null,null,null,null,null,null,null,"H","H",null,null,null,null,null,null,null,null,null,null,null,null,null,null,null,null,null,null,null,null,null,null,null,null,null,null,null,null,null,null,null,null,null,null,null,null,null,null,null,null,null,null,null,null,null,null,null,null,null,null,null,null,null,null,null,null,null,null,null,null,null,null,null,null,null,null,null,null,null,null,null,null,null,null,null,null,null,null,null,null,null,null,null,null,null,null,null,null,null,null,null,null,null,null,null,null,null,null,null,null,null,null,null,null,null,null,null,null,"H",null,null,null,null,null,null,null,null,null,null,null,null,null,null,null,null,null,null,null,null,null,null,null,null,null,"H",null,null,null,null,null,null,null,null,null,null,null,null,null,null,null,null,null,null,null,null,null,null,null,null,null,null,null,null,null,null,null,null,null,null,null,null,null,null,null,null,null,null,null,null,"H"]
["Exterior","All","All",null,null,3,"Rough Grading",null,null,null,null,null,null,null,null,null,null,null,null,null,null,null,null,null,null,null,null,null,null,null,null,null,null,null,null,null,null,null,null,null,null,null,null,null,null,null,null,null,null,null,null,null,null,null,null,null,null,null,null,null,null,null,null,null,null,null,null,null,null,null,null,null,null,null,null,null,null,null,null,null,null,null,null,null,null,null,null,null,null,null,null,null,null,null,null,null,null,"H",null,null,null,null,null,null,null,null,null,null,null,null,null,null,null,null,null,null,null,null,null,null,null,null,"H",null,null,null,null,null,null,null,null,null,null,null,null,null,null,null,null,null,null,null,null,null,null,null,null,null,null,null,null,null,null,null,null,null,null,null,null,null,null,null,null,null,null,null,null,null,null,"H",null,null,null,null,null,null,null,null,null,null,null,null,null,null,null,null,null,null,null,null,null,null,null,null,null,null,null,null,null,null,null,null,null,null,null,null,null,null,null,null,null,null,null,null,null,null,null,null,null,null,null,null,null,"H","H","H","H",null,null,null,null,null,null,null,null,null,null,null,null,null,null,null,null,null,null,null,null,"H","H",null,null,null,null,null,null,null,null,null,null,null,null,null,null,null,null,null,null,null,null,null,null,null,null,null,null,null,null,null,null,null,null,null,null,null,null,null,null,null,null,null,null,null,null,null,null,null,null,null,null,null,null,null,null,null,null,null,null,null,null,null,null,null,null,null,null,null,null,null,null,null,null,null,null,null,null,null,null,null,null,null,null,null,null,null,null,null,null,null,null,null,null,null,null,null,null,null,null,null,null,null,null,null,null,null,null,null,null,"H",null,null,null,null,null,null,null,null,null,null,null,null,null,null,null,null,null,null,null,null,null,null,null,null,null,"H",null,null,null,null,null,null,null,null,null,null,null,null,null,null,null,null,null,null,null,null,null,null,null,null,null,null,null,null,null,null,null,null,null,null,null,null,null,null,null,null,null,null,null,null,"H"]
["Exterior","All","All",null,null,4,"Hardscaping",null,null,null,null,null,null,null,null,null,null,null,null,null,null,null,null,null,null,null,null,null,null,null,null,null,null,null,null,null,null,null,null,null,null,null,null,null,null,null,null,null,null,null,null,null,null,null,null,null,null,null,null,null,null,null,null,null,null,null,null,null,null,null,null,null,null,null,null,null,null,null,null,null,null,null,null,null,null,null,null,null,null,null,null,null,null,null,null,null,null,"H",null,null,null,null,null,null,null,null,null,null,null,null,null,null,null,null,null,null,null,null,null,null,null,null,"H",null,null,null,null,null,null,null,null,null,null,null,null,null,null,null,null,null,null,null,null,null,null,null,null,null,null,null,null,null,null,null,null,null,null,null,null,null,null,null,null,null,null,null,null,null,null,"H",null,null,null,null,null,null,null,null,null,null,null,null,null,null,null,null,null,null,null,null,null,null,null,null,null,null,null,null,null,null,null,null,null,null,null,null,null,null,null,null,null,null,null,null,null,null,null,null,null,null,null,null,null,"H","H","H","H",null,null,null,null,null,null,null,null,null,null,null,null,null,null,null,null,null,null,null,null,"H","H",null,null,null,null,null,null,null,null,null,null,null,null,null,null,null,null,null,null,null,null,null,null,null,null,null,null,null,null,null,null,null,null,null,null,null,null,null,null,null,null,null,null,null,null,null,null,null,null,null,null,null,null,null,null,null,null,null,null,null,null,null,null,null,null,null,null,null,null,null,"F","F","F","F","F","F","F","F","F","F","F","F","F","F","F","F","F","F","F","F","F","F","F","F","F",null,null,null,null,null,null,null,null,null,null,null,null,null,null,"H",null,null,null,null,null,null,null,null,null,null,null,null,null,null,null,null,null,null,null,null,null,null,null,null,null,"H",null,null,null,null,null,null,null,null,null,null,null,null,null,null,null,null,null,null,null,null,null,null,null,null,null,null,null,null,null,null,null,null,null,null,null,null,null,null,null,null,null,null,null,null,"H"]
["Exterior","Roof","Area A",null,null,5,"Trees & Irrigation",null,null,null,null,null,null,null,null,null,null,null,null,null,null,null,null,null,null,null,null,null,null,null,null,null,null,null,null,null,null,null,null,null,null,null,null,null,null,null,null,null,null,null,null,null,null,null,null,null,null,null,null,null,null,null,null,null,null,null,null,null,null,null,null,null,null,null,null,null,null,null,null,null,null,null,null,null,null,null,null,null,null,null,null,null,null,null,null,null,null,"H",null,null,null,null,null,null,null,null,null,null,null,null,null,null,null,null,null,null,null,null,null,null,null,null,"H",null,null,null,null,null,null,null,null,null,null,null,null,null,null,null,null,null,null,null,null,null,null,null,null,null,null,null,null,null,null,null,null,null,null,null,null,null,null,null,null,null,null,null,null,null,null,"H",null,null,null,null,null,null,null,null,null,null,null,null,null,null,null,null,null,null,null,null,null,null,null,null,null,null,null,null,null,null,null,null,null,null,null,null,null,null,null,null,null,null,null,null,null,null,null,null,null,null,null,null,null,"H","H","H","H",null,null,null,null,null,null,null,null,null,null,null,null,null,null,null,null,null,null,null,null,"H","H",null,null,null,null,"B","B","B","B","B",null,null,null,null,null,null,null,null,null,null,null,null,null,null,null,"Roofing Area A",null,null,null,null,null,null,null,null,null,null,null,null,null,null,null,null,null,null,null,null,null,null,null,null,null,null,null,null,null,null,null,null,null,null,null,null,null,null,null,null,null,null,null,null,null,null,null,null,null,null,null,null,null,null,null,null,null,null,null,null,null,null,null,null,null,null,null,null,null,null,null,null,null,null,null,null,null,null,null,null,null,null,null,"H",null,null,null,null,null,null,null,null,null,null,null,null,null,null,null,null,null,null,null,null,null,null,null,null,null,"H",null,null,null,null,null,null,null,null,null,null,null,null,null,null,null,null,null,null,null,null,null,null,null,null,null,null,null,null,null,null,null,null,null,null,null,null,null,null,null,null,null,null,null,null,"H"]
["Exterior","Roof","Area B",null,null,6,"Landscaping",null,null,null,null,null,null,null,null,null,null,null,null,null,null,null,null,null,null,null,null,null,null,null,null,null,null,null,null,null,null,null,null,null,null,null,null,null,null,null,null,null,null,null,null,null,null,null,null,null,null,null,null,null,null,null,null,null,null,null,null,null,null,null,null,null,null,null,null,null,null,null,null,null,null,null,null,null,null,null,null,null,null,null,null,null,null,null,null,null,null,"H",null,null,null,null,null,null,null,null,null,null,null,null,null,null,null,null,null,null,null,null,null,null,null,null,"H",null,null,null,null,null,null,null,null,null,null,null,null,null,null,null,null,null,null,null,null,null,null,null,null,null,null,null,null,null,null,null,null,null,null,null,null,null,null,null,null,null,null,null,null,null,null,"H",null,null,null,null,null,null,null,null,null,null,null,null,null,null,null,null,null,null,null,null,null,null,null,null,null,null,null,null,null,null,null,null,null,null,null,null,null,null,null,null,null,null,null,null,null,null,null,null,null,null,null,null,null,"H","H","H","H",null,null,null,null,null,null,null,null,null,null,null,null,null,null,null,null,null,null,null,null,"H","H",null,null,null,null,null,null,null,null,null,null,null,null,null,null,null,null,null,null,null,null,null,null,null,null,null,null,null,null,null,null,null,null,null,null,null,null,null,null,null,"Roofing Area B",null,null,null,null,null,null,null,null,null,null,null,null,null,null,null,null,null,null,null,null,null,null,null,null,null,null,null,null,null,null,null,null,null,null,null,null,null,null,null,null,null,null,null,null,null,null,null,null,null,null,null,null,null,null,null,null,null,null,null,null,null,null,null,null,null,null,null,null,"H",null,null,null,null,null,null,null,null,null,null,null,null,null,null,null,null,null,null,null,null,null,null,null,null,null,"H",null,null,null,null,null,null,null,null,null,null,null,null,null,null,null,null,null,null,null,null,null,null,null,null,null,null,null,null,null,null,null,null,null,null,null,null,null,null,null,null,null,null,null,null,"H"]
["Sitework","Sitework","Sitework",null,null,7,"Paving",null,null,null,null,null,null,null,null,null,null,null,null,null,null,null,null,null,null,null,null,null,null,null,null,null,null,null,null,null,null,null,null,null,null,null,null,null,null,null,null,null,null,null,null,null,null,null,null,null,null,null,null,null,null,null,null,null,null,null,null,null,null,null,null,null,null,null,null,null,null,null,null,null,null,null,null,null,null,null,null,null,null,null,null,null,null,null,null,null,null,"H",null,null,null,null,null,null,null,null,null,null,null,null,null,null,null,null,null,null,null,null,null,null,null,null,"H",null,null,null,null,null,null,null,null,null,null,null,null,null,null,null,null,null,null,null,null,null,null,null,null,null,null,null,null,null,null,null,null,null,null,null,null,null,null,null,null,null,null,null,null,null,null,"H",null,null,null,null,null,null,null,null,null,null,null,null,null,null,null,null,null,null,null,null,null,null,null,null,null,null,null,null,null,null,null,null,null,null,null,null,null,null,null,null,null,null,null,null,null,null,null,null,null,null,null,null,null,"H","H","H","H",null,null,null,null,null,null,null,null,null,null,null,null,null,null,null,null,null,null,null,null,"H","H",null,null,null,null,null,null,null,null,null,null,null,null,null,null,null,null,null,null,null,null,null,null,null,null,null,null,null,null,null,null,null,null,null,null,null,null,null,null,null,null,null,null,null,null,null,null,null,null,null,null,null,null,null,null,null,null,null,null,null,null,null,null,null,null,null,null,null,null,null,null,null,null,null,null,null,null,null,null,null,null,null,null,null,null,null,null,null,null,null,null,null,null,null,null,null,null,null,null,null,null,null,null,null,null,null,null,null,null,"H",null,null,null,null,null,null,null,null,null,null,null,null,null,null,null,null,null,null,null,null,null,null,null,null,null,"H",null,null,null,null,null,null,null,null,null,null,null,null,null,null,null,null,null,null,null,null,null,null,null,null,null,null,null,null,null,null,null,null,null,null,null,null,null,null,null,null,null,null,null,null,"H"]
["Sitework","Sitework","Sitework",null,null,8,"Site Finishes",null,null,null,null,null,null,null,null,null,null,null,null,null,null,null,null,null,null,null,null,null,null,null,null,null,null,null,null,null,null,null,null,null,null,null,null,null,null,null,null,null,null,null,null,null,null,null,null,null,null,null,null,null,null,null,null,null,null,null,null,null,null,null,null,null,null,null,null,null,null,null,null,null,null,null,null,null,null,null,null,null,null,null,null,null,null,null,null,null,null,"H",null,null,null,null,null,null,null,null,null,null,null,null,null,null,null,null,null,null,null,null,null,null,null,null,"H",null,null,null,null,null,null,null,null,null,null,null,null,null,null,null,null,null,null,null,null,null,null,null,null,null,null,null,null,null,null,null,null,null,null,null,null,null,null,null,null,null,null,null,null,null,null,"H",null,null,null,null,null,null,null,null,null,null,null,null,null,null,null,null,null,null,null,null,null,null,null,null,null,null,null,null,null,null,null,null,null,null,null,null,null,null,null,null,null,null,null,null,null,null,null,null,null,null,null,null,null,"H","H","H","H",null,null,null,null,null,null,null,null,null,null,null,null,null,null,null,null,null,null,null,null,"H","H",null,null,null,null,null,null,null,null,null,null,null,null,null,null,null,null,null,null,null,null,null,null,null,null,null,null,null,null,null,null,null,null,null,null,null,null,null,null,null,null,null,null,null,null,null,null,null,null,null,null,null,null,null,null,null,null,null,null,null,null,null,null,null,null,null,null,null,null,null,null,null,null,null,null,null,null,null,null,null,null,null,null,null,null,null,null,null,null,null,null,null,null,null,null,null,null,null,null,null,null,null,null,null,null,null,null,null,null,"H",null,null,null,null,null,null,null,null,null,null,null,null,null,null,null,null,null,null,null,null,null,null,null,null,null,"H",null,null,null,null,null,null,null,null,null,null,null,null,null,null,null,null,null,null,null,null,null,null,null,null,null,null,null,null,null,null,null,null,null,null,null,null,null,null,null,null,null,null,null,null,"H"]
["Sitework","Sitework","Area A",null,null,null,null,null,null,null,null,null,null,null,null,null,null,null,null,null,null,null,null,null,null,null,null,null,null,null,null,null,null,null,null,null,null,null,null,null,null,null,null,null,null,null,null,null,null,null,null,null,null,null,null,null,null,null,null,null,null,null,null,null,null,null,null,null,null,null,null,null,null,null,null,null,null,null,null,null,null,null,null,null,null,null,null,null,null,null,null,null,null,null,null,null,null,"H",null,null,null,null,null,null,null,null,null,null,null,null,null,null,null,null,null,null,null,null,null,null,null,null,"H",null,null,null,null,null,null,null,null,null,null,null,null,null,null,null,null,null,null,null,null,null,null,null,null,null,null,null,null,null,null,null,null,null,null,null,null,null,null,null,null,null,null,null,null,null,null,"H",null,null,null,null,null,null,null,null,null,null,null,null,null,null,null,null,null,null,null,null,null,null,null,null,null,null,null,null,null,null,null,null,null,null,null,null,null,null,null,null,null,null,null,null,null,null,null,null,null,null,null,null,null,"H","H","H","H",null,null,null,null,null,null,null,null,null,null,null,null,null,null,null,null,null,null,null,null,"H","H",null,null,null,null,null,null,null,null,null,null,null,null,null,null,null,null,null,null,null,null,null,null,null,null,null,null,null,null,null,null,null,null,null,null,null,null,null,null,null,null,null,null,null,null,null,null,null,null,null,null,null,null,null,null,null,null,null,null,null,null,null,null,null,null,null,null,null,null,null,null,null,null,null,null,null,null,null,null,null,null,null,null,null,null,null,null,null,null,null,null,null,null,null,"AREA A",1,1,1,1,1,2,2,2,2,2,3,3,3,3,"H",3,5,5,5,5,5,6,6,6,6,6,7,7,7,7,7,8,8,8,8,8,null,null,null,null,"H",null,null,null,null,null,null,null,null,null,null,null,null,null,null,null,null,null,null,null,null,null,null,null,null,null,null,null,null,null,null,null,null,null,null,null,null,null,null,null,null,null,null,null,null,"H"]
["Sitework","Sitework","Area B",null,null,null,null,null,null,null,null,null,null,null,null,null,null,null,null,null,null,null,null,null,null,null,null,null,null,null,null,null,null,null,null,null,null,null,null,null,null,null,null,null,null,null,null,null,null,null,null,null,null,null,null,null,null,null,null,null,null,null,null,null,null,null,null,null,null,null,null,null,null,null,null,null,null,null,null,null,null,null,null,null,null,null,null,null,null,null,null,null,null,null,null,null,null,"H",null,null,null,null,null,null,null,null,null,null,null,null,null,null,null,null,null,null,null,null,null,null,null,null,"H",null,null,null,null,null,null,null,null,null,null,null,null,null,null,null,null,null,null,null,null,null,null,null,null,null,null,null,null,null,null,null,null,null,null,null,null,null,null,null,null,null,null,null,null,null,null,"H",null,null,null,null,null,null,null,null,null,null,null,null,null,null,null,null,null,null,null,null,null,null,null,null,null,null,null,null,null,null,null,null,null,null,null,null,null,null,null,null,null,null,null,null,null,null,null,null,null,null,null,null,null,"H","H","H","H",null,null,null,null,null,null,null,null,null,null,null,null,null,null,null,null,null,null,null,null,"H","H",null,null,null,null,null,null,null,null,null,null,null,null,null,null,null,null,null,null,null,null,null,null,null,null,null,null,null,null,null,null,null,null,null,null,null,null,null,null,null,null,null,null,null,null,null,null,null,null,null,null,null,null,null,null,null,null,null,null,null,null,null,null,null,null,null,null,null,null,null,null,null,null,null,null,null,null,null,null,null,null,null,null,null,null,null,null,null,null,null,null,null,null,null,null,null,null,null,null,"AREA B",1,1,1,1,1,2,2,2,2,"H",2,3,3,3,3,3,5,5,5,5,5,6,6,6,6,6,7,7,7,7,7,8,8,8,8,"H",8,null,null,null,null,null,null,null,null,null,null,null,null,null,null,null,null,null,null,null,null,null,null,null,null,null,null,null,null,null,null,null,null,null,null,null,null,null,null,null,null,null,null,null,"H"]
["Sitework","Sitework","Area C",null,null,null,null,null,null,null,null,null,null,null,null,null,null,null,null,null,null,null,null,null,null,null,null,null,null,null,null,null,null,null,null,null,null,null,null,null,null,null,null,null,null,null,null,null,null,null,null,null,null,null,null,null,null,null,null,null,null,null,null,null,null,null,null,null,null,null,null,null,null,null,null,null,null,null,null,null,null,null,null,null,null,null,null,null,null,null,null,null,null,null,null,null,null,"H",null,null,null,null,null,null,null,null,null,null,null,null,null,null,null,null,null,null,null,null,null,null,null,null,"H",null,null,null,null,null,null,null,null,null,null,null,null,null,null,null,null,null,null,null,null,null,null,null,null,null,null,null,null,null,null,null,null,null,null,null,null,null,null,null,null,null,null,null,null,null,null,"H",null,null,null,null,null,null,null,null,null,null,null,null,null,null,null,null,null,null,null,null,null,null,null,null,null,null,null,null,null,null,null,null,null,null,null,null,null,null,null,null,null,null,null,null,null,null,null,null,null,null,null,null,null,"H","H","H","H",null,null,null,null,null,null,null,null,null,null,null,null,null,null,null,null,null,null,null,null,"H","H",null,null,null,null,null,null,null,null,null,null,null,null,null,null,null,null,null,null,null,null,null,null,null,null,null,null,null,null,null,null,null,null,null,null,null,null,null,null,null,null,null,null,null,null,null,null,null,null,null,null,null,null,null,null,null,null,null,null,null,null,null,null,null,null,null,null,null,null,null,null,null,null,null,null,null,null,null,null,null,null,null,null,null,null,null,null,null,null,null,null,null,null,null,null,null,null,null,null,null,null,null,null,null,"AREA C",1,1,1,1,"H",1,2,2,2,2,2,3,3,3,3,3,5,5,5,5,5,6,6,6,6,6,7,7,7,7,"H",7,8,8,8,8,8,"B","B","B","B","B","B","B","B","B","B","B","B","B","B","B","B","B","B","B","B","B","B","B","B","B","B","B","B","B","B","B","B",null,null,null,null,null,null,"H"]
[null,null,null,null,null,null,null,null,null,null,null,null,null,null,null,null,null,null,null,null,null,null,null,null,null,null,null,null,null,null,null,null,null,null,null,null,null,null,null,null,null,null,null,null,null,null,null,null,null,null,null,null,null,null,null,null,null,null,null,null,null,null,null,null,null,null,null,null,null,null,null,null,null,null,null,null,null,null,null,null,null,null,null,null,null,null,null,null,null,null,null,null,null,null,null,null,null,"H",null,null,null,null,null,null,null,null,null,null,null,null,null,null,null,null,null,null,null,null,null,null,null,null,"H",null,null,null,null,null,null,null,null,null,null,null,null,null,null,null,null,null,null,null,null,null,null,null,null,null,null,null,null,null,null,null,null,null,null,null,null,null,null,null,null,null,null,null,null,null,null,"H",null,null,null,null,null,null,null,null,null,null,null,null,null,null,null,null,null,null,null,null,null,null,null,null,null,null,null,null,null,null,null,null,null,null,null,null,null,null,null,null,null,null,null,null,null,null,null,null,null,null,null,null,null,"H","H","H","H",null,null,null,null,null,null,null,null,null,null,null,null,null,null,null,null,null,null,null,null,"H","H",null,null,null,null,null,null,null,null,null,null,null,null,null,null,null,null,null,null,null,null,null,null,null,null,null,null,null,null,null,null,null,null,null,null,null,null,null,null,null,null,null,null,null,null,null,null,null,null,null,null,null,null,null,null,null,null,null,null,null,null,null,null,null,null,null,null,null,null,null,null,null,null,null,null,null,null,null,null,null,null,null,null,null,null,null,null,null,null,null,null,null,null,null,null,null,null,null,null,null,null,null,null,null,null,null,null,null,null,"H",null,null,null,null,null,null,null,null,null,null,null,null,null,null,null,null,null,null,null,null,null,null,null,null,null,"H",null,null,null,null,null,null,null,null,null,null,null,null,null,null,null,null,null,null,null,null,null,null,null,null,null,null,null,null,null,null,null,null,null,null,null,null,null,null,null,null,null,null,null,null,"H"]
[null,null,null,null,null,null,null,null,null,null,null,null,null,null,null,null,null,null,null,null,null,null,null,null,null,null,null,null,null,null,null,null,null,null,null,null,null,null,null,null,null,null,null,null,null,null,null,null,null,null,null,null,null,null,null,null,null,null,null,null,null,null,null,null,null,null,null,null,null,null,null,null,null,null,null,null,null,null,null,null,null,null,null,null,null,null,null,null,null,null,null,null,null,null,null,null,null,null,null,null,null,null,null,null,null,null,null,null,null,null,null,null,null,null,null,null,null,null,null,null,null,null,null,null,null,null,null,null,null,null,null,null,null,null,null,null,null,null,null,null,null,null,null,null,null,null,null,null,null,null,null,null,null,null,null,null,null,null,null,null,null,null,null,null,null,null,null,null,null,"H",null,null,null,null,null,null,null,null,null,null,null,null,null,null,null,null,null,null,null,null,null,null,null,null,null,null,null,null,null,null,null,null,null,null,null,null,null,null,null,null,null,null,null,null,null,null,null,null,null,null,null,null,null,"H","H","H","H",null,null,null,null,null,null,null,null,null,null,null,null,null,null,null,null,null,null,null,null,"H","H",null,null,null,null,null,null,null,null,null,null,null,null,null,null,null,null,null,null,null,null,null,null,null,null,null,null,null,null,null,null,null,null,null,null,null,null,null,null,null,null,null,null,null,null,null,null,null,null,null,null,null,null,null,null,null,null,null,null,null,null,null,null,null,null,null,null,null,null,null,null,null,null,null,null,null,null,null,null,null,null,null,null,null,null,null,null,null,null,null,null,null,null,null,null,null,null,null,null,null,null,null,null,null,null,null,null,null,null,"H",null,null,null,null,null,null,null,null,null,null,null,null,null,null,null,null,null,null,null,null,null,null,null,null,null,"H",null,null,null,null,null,null,null,null,null,null,null,null,null,null,null,null,null,null,null,null,null,null,null,null,null,null,null,null,null,null,null,null,null,null,null,null,null,null,null,null,null,null,null,null,"H"]
[null,null,null,null,null,null,null,null,null,null,null,null,null,null,null,null,null,null,null,null,null,null,null,null,null,null,null,null,null,null,null,null,null,null,null,null,null,null,null,null,null,null,null,null,null,null,null,null,null,null,null,null,null,null,null,null,null,null,null,null,null,null,null,null,null,null,null,null,null,null,null,null,null,null,null,null,null,null,null,null,null,null,null,null,null,null,null,null,null,null,null,null,null,null,null,null,null,null,null,null,null,null,null,null,null,null,null,null,null,null,null,null,null,null,null,null,null,null,null,null,null,null,null,null,null,null,null,null,null,null,null,null,null,null,null,null,null,null,null,null,null,null,null,null,null,null,null,null,null,null,null,null,null,null,null,null,null,null,null,null,null,null,null,null,null,null,null,null,null,"H",null,null,null,null,null,null,null,null,null,null,null,null,null,null,null,null,null,null,null,null,null,null,null,null,null,null,null,null,null,null,null,null,null,null,null,null,null,null,null,null,null,null,null,null,null,null,null,null,null,null,null,null,null,"H","H","H","H",null,null,null,null,null,null,null,null,null,null,null,null,null,null,null,null,null,null,null,null,"H","H",null,null,null,null,null,null,null,null,null,null,null,null,null,null,null,null,null,null,null,null,null,null,null,null,null,null,null,null,null,null,null,null,null,null,null,null,null,null,null,null,null,null,null,null,null,null,null,null,null,null,null,null,null,null,null,null,null,null,null,null,null,null,null,null,null,null,null,null,null,null,null,null,null,null,null,null,null,null,null,null,null,null,null,null,null,null,null,null,null,null,null,null,null,null,null,null,null,null,null,null,null,null,null,null,null,null,null,null,"H",null,null,null,null,null,null,null,null,null,null,null,null,null,null,null,null,null,null,null,null,null,null,null,null,null,"H",null,null,null,null,null,null,null,null,null,null,null,null,null,null,null,null,null,null,null,null,null,null,null,null,null,null,null,null,null,null,null,null,null,null,null,null,null,null,null,null,null,null,null,null,"H"]
[null,null,null,null,null,null,null,null,null,null,null,null,null,null,null,null,null,null,null,null,null,null,null,null,null,null,null,null,null,null,null,null,null,null,null,null,null,null,null,null,null,null,null,null,null,null,null,null,null,null,null,null,null,null,null,null,null,null,null,null,null,null,null,null,null,null,null,null,null,null,null,null,null,null,null,null,null,null,null,null,null,null,null,null,null,null,null,null,null,null,null,null,null,null,null,null,null,null,null,null,null,null,null,null,null,null,null,null,null,null,null,null,null,null,null,null,null,null,null,null,null,null,null,null,null,null,null,null,null,null,null,null,null,null,null,null,null,null,null,null,null,null,null,null,null,null,null,null,null,null,null,null,null,null,null,null,null,null,null,null,null,null,null,null,null,null,null,null,null,"H",null,null,null,null,null,null,null,null,null,null,null,null,null,null,null,null,null,null,null,null,null,null,null,null,null,null,null,null,null,null,null,null,null,null,null,null,null,null,null,null,null,null,null,null,null,null,null,null,null,null,null,null,null,"H","H","H","H",null,null,null,null,null,null,null,null,null,null,null,null,null,null,null,null,null,null,null,null,"H","H",null,null,null,null,null,null,null,null,null,null,null,null,null,null,null,null,null,null,null,null,null,null,null,null,null,null,null,null,null,null,null,null,null,null,null,null,null,null,null,null,null,null,null,null,null,null,null,null,null,null,null,null,null,null,null,null,null,null,null,null,null,null,null,null,null,null,null,null,null,null,null,null,null,null,null,null,null,null,null,null,null,null,null,null,null,null,null,null,null,null,null,null,null,null,null,null,null,null,null,null,null,null,null,null,null,null,null,null,"H",null,null,null,null,null,null,null,null,null,null,null,null,null,null,null,null,null,null,null,null,null,null,null,null,null,"H",null,null,null,null,null,null,null,null,null,null,null,null,null,null,null,null,null,null,null,null,null,null,null,null,null,null,null,null,null,null,null,null,null,null,null,null,null,null,null,null,null,null,null,null,"H"]
[null,null,null,null,null,null,null,null,null,null,null,null,null,null,null,null,null,null,null,null,null,null,null,null,null,null,null,null,null,null,null,null,null,null,null,null,null,null,null,null,null,null,null,null,null,null,null,null,null,null,null,null,null,null,null,null,null,null,null,null,null,null,null,null,null,null,null,null,null,null,null,null,null,null,null,null,null,null,null,null,null,null,null,null,null,null,null,null,null,null,null,null,null,null,null,null,null,null,null,null,null,null,null,null,null,null,null,null,null,null,null,null,null,null,null,null,null,null,null,null,null,null,null,null,null,null,null,null,null,null,null,null,null,null,null,null,null,null,null,null,null,null,null,null,null,null,null,null,null,null,null,null,null,null,null,null,null,null,null,null,null,null,null,null,null,null,null,null,null,"H",null,null,null,null,null,null,null,null,null,null,null,null,null,null,null,null,null,null,null,null,null,null,null,null,null,null,null,null,null,null,null,null,null,null,null,null,null,null,null,null,null,null,null,null,null,null,null,null,null,null,null,null,null,"H","H","H","H",null,null,null,null,null,null,null,null,null,null,null,null,null,null,null,null,null,null,null,null,"H","H",null,null,null,null,null,null,null,null,null,null,null,null,null,null,null,null,null,null,null,null,null,null,null,null,null,null,null,null,null,null,null,null,null,null,null,null,null,null,null,null,null,null,null,null,null,null,null,null,null,null,null,null,null,null,null,null,null,null,null,null,null,null,null,null,null,null,null,null,null,null,null,null,null,null,null,null,null,null,null,null,null,null,null,null,null,null,null,null,null,null,null,null,null,null,null,null,null,null,null,null,null,null,null,null,null,null,null,null,"H",null,null,null,null,null,null,null,null,null,null,null,null,null,null,null,null,null,null,null,null,null,null,null,null,null,"H",null,null,null,null,null,null,null,null,null,null,null,null,null,null,null,null,null,null,null,null,null,null,null,null,null,null,null,null,null,null,null,null,null,null,null,null,null,null,null,null,null,null,null,null,"H"]
[null,null,null,null,null,null,null,null,null,null,null,null,null,null,null,null,null,null,null,null,null,null,null,null,null,null,null,null,null,null,null,null,null,null,null,null,null,null,null,null,null,null,null,null,null,null,null,null,null,null,null,null,null,null,null,null,null,null,null,null,null,null,null,null,null,null,null,null,null,null,null,null,null,null,null,null,null,null,null,null,null,null,null,null,null,null,null,null,null,null,null,null,null,null,null,null,null,null,null,null,null,null,null,null,null,null,null,null,null,null,null,null,null,null,null,null,null,null,null,null,null,null,null,null,null,null,null,null,null,null,null,null,null,null,null,null,null,null,null,null,null,null,null,null,null,null,null,null,null,null,null,null,null,null,null,null,null,null,null,null,null,null,null,null,null,null,null,null,null,"H",null,null,null,null,null,null,null,null,null,null,null,null,null,null,null,null,null,null,null,null,null,null,null,null,null,null,null,null,null,null,null,null,null,null,null,null,null,null,null,null,null,null,null,null,null,null,null,null,null,null,null,null,null,"H","H","H","H",null,null,null,null,null,null,null,null,null,null,null,null,null,null,null,null,null,null,null,null,"H","H",null,null,null,null,null,null,null,null,null,null,null,null,null,null,null,null,null,null,null,null,null,null,null,null,null,null,null,null,null,null,null,null,null,null,null,null,null,null,null,null,null,null,null,null,null,null,null,null,null,null,null,null,null,null,null,null,null,null,null,null,null,null,null,null,null,null,null,null,null,null,null,null,null,null,null,null,null,null,null,null,null,null,null,null,null,null,null,null,null,null,null,null,null,null,null,null,null,null,null,null,null,null,null,null,null,null,null,null,"H",null,null,null,null,null,null,null,null,null,null,null,null,null,null,null,null,null,null,null,null,null,null,null,null,null,"H",null,null,null,null,null,null,null,null,null,null,null,null,null,null,null,null,null,null,null,null,null,null,null,null,null,null,null,null,null,null,null,null,null,null,null,null,null,null,null,null,null,null,null,null,"H"]

{"sheet":"VBA Macros Instructions ","index":6,"n_rows":11,"n_cols":4,"rows_kept":11,"cut":false,"hidden":false,"merged":[[12,1,12,3],[14,1,51,3]]}
[]
[]
[]
[]
[]
[]
[]
[null,"Macro","Output Sheet","Purpose"]
[null,"GenerateWWP","WWP","Creates a Weekly Work Plan based on the selected start date."]
[null,"CleanWWP","WWP","Clears the current WWP safely while preserving headers."]
[null,"TaktPlan_Macro","6WLA","Generates a 6-Week Lookahead plan directly from the NORM schedule."]

{"sheet":"WWP (Automatic)","index":7,"n_rows":4,"n_cols":12,"rows_kept":4,"cut":false,"hidden":false,"merged":[]}
["2022-03-17",null,null,null,null,null,16,17,18,21,22]
["Phase","Zone","Area","Trade","Activity Code","Description","W","TH","F","M","T","Notes"]
["Sitework","General",null,"Earthwork","1H","Excavation/Grading"]
["Sitework","General",null,"Utilities","1I","Install Storm/Sanitary/Water/Dry U.G. Utilities"]

{"sheet":"6WLA (Automatic)","index":8,"n_rows":6,"n_cols":33,"rows_kept":6,"cut":false,"hidden":false,"merged":[[4,0,5,0],[0,3,0,32],[1,3,1,21],[1,22,1,32]]}
["2022-06-07",null,null,2022]
["Interior","Elevator",null,"June",null,null,null,null,null,null,null,null,null,null,null,null,null,null,null,null,null,null,"July"]
[null,"Floor 4",null,"2022-06-07","2022-06-08","2022-06-09","2022-06-10","2022-06-13","2022-06-14","2022-06-15","2022-06-16","2022-06-17","2022-06-20","2022-06-21","2022-06-22","2022-06-23","2022-06-24","2022-06-27","2022-06-28","2022-06-29","2022-06-30","2022-07-01","2022-07-04","2022-07-05","2022-07-06","2022-07-07","2022-07-08","2022-07-11","2022-07-12","2022-07-13","2022-07-14","2022-07-15","2022-07-18"]
["Interior","Elevator","Elevator","T","W","TH","F","M","T","W","TH","F","M","T","W","TH","F","M","T","W","TH","F","M","T","W","TH","F","M","T","W","TH","F","M"]
["Foundations","Zone A","Zone A","F1","F1","F1","F1","F1","F2","F2","F2","F2","F2","F2","F2","F2","F2","F2","F3","F3","F3","F3","H","F3","F3","F3","F3","F3","F3","F4","F4","F4","F4"]
[null,"General","General",null,null,null,null,"ZONE B","F1","F1","F1","F1","F1","F1","F1","F1","F1","F1","F2","F2","F2","F2","H","F2","F2","F2","F2","F2","F2","F3","F3","F3","F3"]

{"sheet":"Logistics Plan","index":9,"n_rows":90,"n_cols":28,"rows_kept":90,"cut":false,"hidden":false,"merged":[[72,25,73,25],[72,26,73,26],[89,2,110,27],[72,17,73,17],[72,18,73,18],[72,20,73,20],[72,21,73,21],[72,22,73,22],[72,24,73,24],[72,9,73,9],[72,10,73,10],[72,12,73,12],[72,13,73,13],[72,14,73,14],[72,16,73,16],[72,2,73,2],[72,3,73,3],[72,4,73,4],[72,5,73,5],[72,6,73,6],[72,8,73,8]]}
[]
[]
[]
[]
[]
[]
[]
[]
[]
[]
[]
[]
[]
[]
[]
[]
[]
[]
[]
[]
[]
[]
[]
[]
[]
[]
[]
[]
[]
[]
[]
[]
[]
[]
[]
[]
[]
[]
[]
[]
[]
[]
[]
[]
[]
[]
[]
[]
[]
[]
[]
[]
[]
[]
[]
[]
[]
[]
[]
[]
[]
[]
[]
[]
[]
[]
[]
[]
[]
[]
[]
[]
[null,null,"CURRENT WEEK","AREA/ZONE","CRANE","FORKLIFT","HOIST","MONDAY","CRANE","FORKLIFT","HOIST","TUESDAY","CRANE","FORKLIFT","HOIST","WEDNESDAY","CRANE","FORKLIFT","HOIST","THURSDAY","CRANE","FORKLIFT","HOIST","FRIDAY","CRANE","FORKLIFT","HOIST","SATURDAY"]
[null,null,null,null,null,null,null,"DESCRIPTION",null,null,null,"DESCRIPTION",null,null,null,"DESCRIPTION",null,null,null,"DESCRIPTION",null,null,null,"DESCRIPTION",null,null,null,"DESCRIPTION"]
[null,null,"05:00:00"]
[null,null,"06:00:00"]
[null,null,"07:00:00"]
[null,null,"08:00:00"]
[null,null,"09:00:00"]
[null,null,"10:00:00"]
[null,null,"11:00:00"]
[null,null,"12:00:00"]
[null,null,"13:00:00"]
[null,null,"14:00:00"]
[null,null,"15:00:00"]
[null,null,"16:00:00"]
[null,null,"17:00:00"]
[null,null,"18:00:00"]
[null,null,"19:00:00"]
[null,null,"NOTES: "]

{"sheet":"6WLA (Manual)","index":10,"n_rows":41,"n_cols":39,"rows_kept":41,"cut":false,"hidden":false,"merged":[[4,26,4,30],[4,31,4,35],[3,6,3,10],[3,11,3,15],[3,16,3,20],[3,21,3,25],[3,26,3,30],[3,31,3,35],[4,6,4,10],[4,11,4,15],[4,16,4,20],[4,21,4,25],[7,3,8,5],[9,36,9,38],[10,4,13,5],[10,36,13,37],[15,3,27,3],[15,4,17,4],[15,37,17,37],[15,38,27,38],[18,4,27,4],[18,37,27,37],[14,3,14,5],[9,3,9,5],[28,3,28,5],[29,3,40,3],[29,4,30,4],[29,37,30,37],[29,38,40,38],[31,4,34,4],[31,37,34,37],[35,4,38,4],[35,37,38,37],[39,4,40,4],[39,37,40,37]]}
[]
[]
[]
[null,null,null,null,null,null,{"$f":"YEAR(G6)","v":2023},null,null,null,null,{"$f":"YEAR(L6)","v":2023},null,null,null,null,{"$f":"YEAR(Q6)","v":2023},null,null,null,null,{"$f":"YEAR(V6)","v":2023},null,null,null,null,{"$f":"YEAR(AA6)","v":2023},null,null,null,null,{"$f":"YEAR(AF6)","v":2023}]
[null,null,null,null,null,null,{"$f":"TEXT(DATE(YEAR(G6),MONTH(G6),DAY(G6)),\"mmmm\")","v":"January"},null,null,null,null,{"$f":"TEXT(DATE(YEAR(L6),MONTH(L6),DAY(L6)),\"mmmm\")","v":"January"},null,null,null,null,{"$f":"TEXT(DATE(YEAR(Q6),MONTH(Q6),DAY(Q6)),\"mmmm\")","v":"January"},null,null,null,null,{"$f":"TEXT(DATE(YEAR(V6),MONTH(V6),DAY(V6)),\"mmmm\")","v":"February"},null,null,null,null,{"$f":"TEXT(DATE(YEAR(AA6),MONTH(AA6),DAY(AA6)),\"mmmm\")","v":"February"},null,null,null,null,{"$f":"TEXT(DATE(YEAR(AF6),MONTH(AF6),DAY(AF6)),\"mmmm\")","v":"February"}]
[null,null,null,null,null,null,"2023-01-16",{"$f":"G6+1","v":"2023-01-17"},{"$f":"H6+1","v":"2023-01-18"},"2023-01-19","2023-01-20",{"$f":"K6+3","v":"2023-01-23"},{"$f":"L6+1","v":"2023-01-24"},{"$f":"M6+1","v":"2023-01-25"},"2023-01-26","2023-01-27",{"$f":"P6+3","v":"2023-01-30"},{"$f":"Q6+1","v":"2023-01-31"},"2023-02-01","2023-02-02","2023-02-03",{"$f":"U6+3","v":"2023-02-06"},{"$f":"V6+1","v":"2023-02-07"},"2023-02-08","2023-02-09","2023-02-10",{"$f":"Z6+3","v":"2023-02-13"},{"$f":"AA6+1","v":"2023-02-14"},"2023-02-15","2023-02-16","2023-02-17",{"$f":"AE6+3","v":"2023-02-20"},{"$f":"AF6+1","v":"2023-02-21"},"2023-02-22","2023-02-23","2023-02-24"]
[null,null,null,null,null,null,"M","T","W","TH","F","M","T","W","TH","F","M","T","W","TH","F","M","T","W","TH","F","M","T","W","TH","F","M","T","W","TH","F"]
[null,null,null,"PRE-CON MEETINGS",null,null,null,null,null,null,null,null,null,null,null,null,null,null,null,null,"South Exterioirs EIFS"]
[null,null,null,null,null,null,null,null,null,null,"Level 2 Zone E&F Framing",null,null,null,null,null,null,null,null,null,"Level 3 Fire Sprinkler",null,null,null,null,"Level 3 OH MEP"]
[null,null,null,"STAIRS & ELEVATORS",null,null,null,null,null,null,null,null,null,null,null,null,null,null,null,null,null,null,null,null,null,null,null,null,null,null,null,null,null,null,null,null,"STAIRS & ELEVATORS"]
[null,null,null,null,"BUILDING",null,null,null,null,null,null,null,null,null,null,null,null,null,null,null,null,null,null,null,null,null,null,"Shaft Prep",null,null,null,null,null,null,null,null,"BUILDING"]
[null,null,null,null,null,null,"Erect Stair 2"]
[null,null,null,null,null,null,"Pour  1",null,null,null,null,null,null,null,null,null,null,null,null,null,null,null,"Pour  2"]
[]
[null,null,null,"INTERIORS"]
[null,null,null,"INTERIORS","FLOOR 1","Zone 1A",3,4,4,4,5,5,5,6,6,6,"B","B","B",7,7,7,8,8,8,"B","B","B",9,9,9,10,10,10,11,11,"Zone 1A","FLOOR 1","INTERIORS"]
[null,null,null,null,null,"Zone 1B",2,3,3,3,4,4,4,5,5,5,6,6,6,"B","B","B",7,7,7,8,8,8,"B","B","B",9,9,9,10,10,"Zone 1B"]
[null,null,null,null,null,"Zone 1C",1,2,2,2,3,3,3,4,4,4,5,5,5,6,6,6,"B","B","B",7,7,7,8,8,8,"B","B","B",9,9,"Zone 1C"]
[null,null,null,null,"FLOOR 1","Zone 2A",null,1,1,1,2,2,2,3,3,3,4,4,4,5,5,5,6,6,6,"B","B","B",7,7,7,8,8,8,"B","B","Zone 2A","FLOOR 1"]
[null,null,null,null,null,"Zone 2B",null,null,null,null,1,1,1,2,2,2,3,3,3,4,4,4,5,5,5,6,6,6,"B","B","B",7,7,7,8,8,"Zone 2B"]
[null,null,null,null,null,"Zone 2C",null,null,null,null,null,null,null,1,1,1,2,2,2,3,3,3,4,4,4,5,5,5,6,6,6,"B","B","B",7,7,"Zone 2C"]
[null,null,null,null,null,"Zone 2D",null,null,null,null,null,null,null,null,null,null,1,1,1,2,2,2,3,3,3,4,4,4,5,5,5,6,6,6,"B","B","Zone 2D"]
[null,null,null,null,null,"Zone 2E",null,null,null,null,null,null,null,null,null,null,null,null,null,1,1,1,2,2,2,3,3,3,4,4,4,5,5,5,6,6,"Zone 2E"]
[null,null,null,null,null,"Zone 2F",null,null,null,null,null,null,null,null,null,null,null,null,null,null,null,null,1,1,1,2,2,2,3,3,3,4,4,4,5,5,"Zone 2F"]
[null,null,null,null,null,"Zone 2G",null,null,null,null,null,null,null,null,null,null,null,null,null,null,null,null,null,null,null,1,1,1,2,2,2,3,3,3,4,4,"Zone 2G"]
[null,null,null,null,null,"Zone 2H",null,null,null,null,null,null,null,null,null,null,null,null,null,null,null,null,null,null,null,null,null,null,1,1,1,2,2,2,3,3,"Zone 2H"]
[null,null,null,null,null,"Zone 2I",null,null,null,null,null,null,null,null,null,null,null,null,null,null,null,null,null,null,null,null,null,null,null,null,null,1,1,1,2,2,"Zone 2I"]
[null,null,null,null,null,"Zone 2J",null,null,null,null,null,null,null,null,null,null,null,null,null,null,null,null,null,null,null,null,null,null,null,null,null,null,null,null,1,1,"Zone 2J"]
[null,null,null,"EXTERIORS"]
[null,null,null,"EXTERIORS","WEST","Zone C","E","E",null,null,null,null,null,null,null,null,null,null,null,null,null,null,null,null,null,null,null,null,null,null,null,null,null,null,null,null,"Zone C","WEST","EXTERIORS"]
[null,null,null,null,null,"Zone D","D","D","E","E","E","E","E",null,null,null,null,null,null,null,null,null,null,null,null,null,null,null,null,null,null,null,null,null,null,null,"Zone D"]
[null,null,null,null,"EAST","Zone A","C","C","D","D","D","D","D","E","E","E","E","E",null,null,null,null,null,null,null,null,null,null,null,null,null,null,null,null,null,null,"Zone A","EAST"]
[null,null,null,null,null,"Zone B","B","B","C","C","C","C","C","D","D","D","D","D","E","E","E","E","E",null,null,null,null,null,null,null,null,null,null,null,null,null,"Zone B"]
[null,null,null,null,null,"Zone C","B","B","B","B","B","B","B","C","C","C","C","C","D","D","D","D","D","E","E","E","E","E",null,null,null,null,null,null,null,null,"Zone C"]
[null,null,null,null,null,"Zone D","A","A","B","B","B","B","B","B","B","B","B","B","C","C","C","C","C","D","D","D","D","D","E","E","E","E","E",null,null,null,"Zone D"]
[null,null,null,null,"NORTH","Zone A",null,null,"A","A","A","A","A","B","B","B","B","B","B","B","B","B","B","C","C","C","C","C","D","D","D","D","D","E","E","E","Zone A","NORTH"]
[null,null,null,null,null,"Zone B",null,null,null,null,null,null,null,"A","A","A","A","A","B","B","B","B","B","B","B","B","B","B","C","C","C","C","C","D","D","D","Zone B"]
[null,null,null,null,null,"Zone C",null,null,null,null,null,null,null,null,null,null,null,null,"A","A","A","A","A","B","B","B","B","B","B","B","B","B","B","C","C","C","Zone C"]
[null,null,null,null,null,"Zone D",null,null,null,null,null,null,null,null,null,null,null,null,null,null,null,null,null,"A","A","A","A","A","B","B","B","B","B","B","B","B","Zone D"]
[null,null,null,null,"SOUTH","Zone A",null,null,null,null,null,null,null,null,null,null,null,null,null,null,null,null,null,null,null,null,null,null,"A","A","A","A","A","B","B","B","Zone A","SOUTH"]
[null,null,null,null,null,"Zone B",null,null,null,null,null,null,null,null,null,null,null,null,null,null,null,null,null,null,null,null,null,null,null,null,null,null,null,"A","A","A","Zone B"]

{"sheet":"WWP-One Floor (Manual)","index":11,"n_rows":56,"n_cols":23,"rows_kept":56,"cut":false,"hidden":false,"merged":[[51,4,52,4],[55,17,56,17],[55,18,56,18],[40,17,40,19],[41,2,41,7],[41,13,42,13],[41,17,41,19],[43,2,53,2],[43,3,45,3],[44,4,45,4],[46,3,52,3],[46,4,47,4],[48,4,49,4],[28,2,39,2],[28,3,36,3],[28,4,30,4],[31,4,33,4],[34,4,36,4],[37,3,39,3],[37,4,38,4],[26,21,26,22],[10,2,23,7],[10,8,23,15],[26,2,26,7],[26,13,27,13],[26,17,26,19]]}
[]
[]
[]
[]
[]
[]
[]
[]
[]
[]
[null,null,"ASK QUESTIONS & HAVE A DISCUSSION\n\n1. Ask where your bottleneck zone is\n2. Ask what’s your slowest trades\n3. Discuss any owner changes with the trades\n4. Remind the team of any key project planning items\n5. Discuss key handoffs for the next two days\n6. Discuss any new activities starting\n7. Discuss any quality meetings needed for new work\n8. Discuss deliveries and ask where they go",null,null,null,null,null,"TRADE PARTNER WEEKLY TACTICAL\n\n1. Make the weekly work plan: 1 - Week\n2. Review last week\n3. Review current week\n4. Review current progress\n5. Fill out any one-off activities\n"]
[]
[]
[]
[]
[]
[]
[]
[]
[]
[]
[]
[]
[]
[]
[]
[null,null,"WEEKLY WORK PLAN (JAN 16-20)",null,null,null,null,null,16,17,18,19,20,"NOTES",null,null,null,"PPC",null,null,null,"SUCCESSFUL HANDOFF %"]
[null,null,"PHASE","FLOOR","ZONE","TRADE","#","ACTIVITY","M","T","W","T","F",null,null,null,null,"Planned","Done","%",null,"Planned","Completed"]
[null,null,"INTERIORS","FLOOR 1","Zone 1A","Mechanical #1",3,"OH Mechanical Duct","H",null,null,null,null,null,null,null,null,1,1,{"$f":"IFERROR(S29/R29,\"\")","v":1},null,{"$f":"SUMPRODUCT(LEN(I29:M40) - LEN(SUBSTITUTE(I29:M40, \"H\", \"\"))) + SUMPRODUCT(LEN(I44:M54) - LEN(SUBSTITUTE(I44:M54, \"H\", \"\")))","v":12},11]
[null,null,null,null,null,"Mechanical #2",4,"OH Mech Equip, Piping, Branch Lines & Plumbing",null,null,null,"H",null,null,null,null,null,3,3,{"$f":"IFERROR(S30/R30,\"\")","v":1}]
[null,null,null,null,null,"Electrical",5,"OH Electrical & Frame Walls",null,null,null,null,null,null,null,null,null,1,0,0,null,"PHP = ",{"$f":"W29/V29","v":0.91666666666666663}]
[null,null,null,null,"Zone 1B","FS",2,"Install Fire Sprinkler Main and Branch Lines & Install Priority Walls","H",null,null,null,null,null,null,null,null,1,1,1]
[null,null,null,null,null,"Mechanical #1",3,"OH Mechanical Duct",null,null,null,"H",null,null,null,null,null,3,3,1]
[null,null,null,null,null,"Mechanical #2",4,"OH Mech Equip, Piping, Branch Lines & Plumbing",null,null,null,null,null,null,null,null,null,1,1,1]
[null,null,null,null,"Zone 1C","Concrete",1,"Remove re-shores, Floor Prep, Final Patch Ceiling & Layout Walls","H",null,null,null,null,null,null,null,null,1,1,1]
[null,null,null,null,null,"FS",2,"Install Fire Sprinkler Main and Branch Lines & Install Priority Walls",null,null,null,"H",null,null,null,null,null,3,3,1]
[null,null,null,null,null,"Mechanical #1",3,"OH Mechanical Duct",null,null,null,null,null,null,null,null,null,1,1,1]
[null,null,null,"FLOOR 2","Zone 2A","Concrete",1,"Remove re-shores, Floor Prep, Final Patch Ceiling & Layout Walls",null,null,null,"H",null,null,null,null,null,3,3,1]
[null,null,null,null,null,"FS",2,"Install Fire Sprinkler Main and Branch Lines & Install Priority Walls",null,null,null,null,null,null,null,null,null,1,1,1]
[null,null,null,null,"Zone 2B","Concrete",1,"Remove re-shores, Floor Prep, Final Patch Ceiling & Layout Walls",null,null,null,null,null,null,null,null,null,1,1,1]
[]
[null,null,"WEEKLY WORK PLAN (JAN 16-20)",null,null,null,null,null,16,17,18,19,20,"NOTES",null,null,null,"PPC"]
[null,null,"PHASE","FLOOR","ZONE","TRADE","#","ACTIVITY","M","T","W","T","F",null,null,null,null,"Planned","Done","%"]
[null,null,"EXTERIORS","WEST","ZONE C","Finishers","E","Final Caulking & Finishes",null,"H",null,null,null,null,null,null,null,2,2,1]
[null,null,null,null,"ZONE D","Glaziers","D","Window Installation",null,"H",null,null,null,null,null,null,null,2,2,1]
[null,null,null,null,null,"Finishers","E","Final Caulking & Finishes",null,null,null,null,null,null,null,null,null,3,3,1]
[null,null,null,"EAST","ZONE A","EIFS installers","C","EIFS",null,"H",null,null,null,null,null,null,null,2,1,0.5]
[null,null,null,null,null,"Glaziers","D","Window Installation",null,null,null,null,null,null,null,null,null,3,3,1]
[null,null,null,null,"ZONE B","Framers","B","Framing & Sheathing",null,"H",null,null,null,null,null,null,null,2,1,0.5]
[null,null,null,null,null,"EIFS installers","C","EIFS",null,null,null,null,null,null,null,null,null,3,3,1]
[null,null,null,null,"ZONE C","Framers","B","Framing & Sheathing",null,null,null,null,null,null,null,null,null,5,5,1]
[null,null,null,null,"ZONE D","Steel Erectors","A","Structural Steel Supports",null,"H",null,null,null,null,null,null,null,2,2,1]
[null,null,null,null,null,"Framers","B","Framing & Sheathing",null,null,null,null,null,null,null,null,null,3,3,1]
[null,null,null,"NORTH","ZONE A","Steel Erectors","A","Structural Steel Supports",null,null,null,null,null,null,null,null,null,3,3,1]
[null,null,null,null,null,null,null,null,null,null,null,null,null,null,null,null,null,{"$f":"SUM(R29:R54)","v":50},{"$f":"SUM(S29:S54)","v":47}]
[null,null,null,null,null,null,null,null,null,null,null,null,null,null,null,null,null,"PPC = ",{"$f":"S55/R55","v":0.94}]

{"sheet":"Roadblocks","index":12,"n_rows":46,"n_cols":21,"rows_kept":46,"cut":false,"hidden":false,"merged":[[26,18,26,19],[27,18,27,19],[28,18,28,19],[1,2,17,16],[21,2,21,16],[22,18,22,20],[23,18,23,19],[24,18,24,19],[25,18,25,19]]}
[]
[null,null,"SOLVE PROBLEMS\n\n- By now you will have red markings everywhere on your boards and on Canva. Any of these that are issues that need to be solved now go on the issues board.\n\n- Once all issues are listed you can ids each of them and make assignments below. it is crucial that all assignments are sized in a way that they can be done the next day in that day. if they are bigger than that they go on the team scrum board.\n"]
[]
[]
[]
[]
[]
[]
[]
[]
[]
[]
[]
[]
[]
[]
[]
[]
[]
[]
[]
[null,null,"Roadblock Tracking and Removal Log (ISSUES)"]
[null,null,"No.","Roadblock","Zone","Date Added","Affected Activity","Who is on Point","Classification","Corrective Action","Critical Date","Count Down (Days)","Date Resolved","Process Time","Score","RR","Actions",null,"Dashboard"]
[null,null,1,"Roadblock 1","Zone 1","2024-01-10","Activity X","Person 1","Classification 4",null,"2024-01-22",{"$f":"_xlfn.IFS(F24=\"\",\"\",M24=\"\",K24-TODAY(),M24>0,M24-F24)","v":5},"2024-01-15",{"$f":"_xlfn.IFS(F24=\"\",\"\",M24=\"\",\"In Progress\",M24>0,M24-F24)","v":5},{"$f":"IF(D24=\"\",\"\",IF(N24=\"In Progress\", \"\", M24-K24))","v":-7},{"$f":"IF(Tabla24[[#This Row],[Date Resolved]]=\"\",\"\",Tabla24[[#This Row],[Critical Date]]-Tabla24[[#This Row],[Date Resolved]])","v":7},null,null,"Roadblock < 7 Days to Critical",null,{"$f":"COUNTIF(L24:L45,\"<=\"&TODAY()+7)","v":3}]
[null,null,2,"Roadblock 2","Zone 2","2024-01-22","Activity Y","Person 2","General",null,"2024-02-22",{"$f":"_xlfn.IFS(F25=\"\",\"\",M25=\"\",K25-TODAY(),M25>0,M25-F25)","v":29},"2024-02-20",{"$f":"_xlfn.IFS(F25=\"\",\"\",M25=\"\",\"In Progress\",M25>0,M25-F25)","v":29},{"$f":"IF(D25=\"\",\"\",IF(N25=\"In Progress\", \"\", M25-K25))","v":-2},{"$f":"IF(Tabla24[[#This Row],[Date Resolved]]=\"\",\"\",Tabla24[[#This Row],[Critical Date]]-Tabla24[[#This Row],[Date Resolved]])","v":2},null,null,"Uncleared Roadblocks",null,{"$f":"COUNTIFS(F24:F45,\">=1\",M24:M45,\"\")","v":0}]
[null,null,3,"Roadblock 3","Zone 3","2024-02-23","Activity Z","Person 3","Design",null,"2024-04-15",{"$f":"_xlfn.IFS(F26=\"\",\"\",M26=\"\",K26-TODAY(),M26>0,M26-F26)","v":34},"2024-03-28",{"$f":"_xlfn.IFS(F26=\"\",\"\",M26=\"\",\"In Progress\",M26>0,M26-F26)","v":34},{"$f":"IF(D26=\"\",\"\",IF(N26=\"In Progress\", \"\", M26-K26))","v":-18},{"$f":"IF(Tabla24[[#This Row],[Date Resolved]]=\"\",\"\",Tabla24[[#This Row],[Critical Date]]-Tabla24[[#This Row],[Date Resolved]])","v":18},null,null,"Cleared Roadblocks",null,{"$f":"COUNTIF(M24:M45,\">=1\")","v":3}]
[null,null,null,null,null,null,null,null,null,null,null,{"$f":"_xlfn.IFS(F27=\"\",\"\",M27=\"\",K27-TODAY(),M27>0,M27-F27)","v":""},null,{"$f":"_xlfn.IFS(F27=\"\",\"\",M27=\"\",\"In Progress\",M27>0,M27-F27)","v":""},{"$f":"IF(D27=\"\",\"\",IF(N27=\"In Progress\", \"\", M27-K27))","v":""},{"$f":"IF(Tabla24[[#This Row],[Date Resolved]]=\"\",\"\",Tabla24[[#This Row],[Critical Date]]-Tabla24[[#This Row],[Date Resolved]])","v":""},null,null,"Average Process Time",null,{"$f":"AVERAGE(N24:N45)","v":22.666666666666668}]
[null,null,null,null,null,null,null,null,null,null,null,{"$f":"_xlfn.IFS(F28=\"\",\"\",M28=\"\",K28-TODAY(),M28>0,M28-F28)","v":""},null,{"$f":"_xlfn.IFS(F28=\"\",\"\",M28=\"\",\"In Progress\",M28>0,M28-F28)","v":""},"",{"$f":"IF(Tabla24[[#This Row],[Date Resolved]]=\"\",\"\",Tabla24[[#This Row],[Critical Date]]-Tabla24[[#This Row],[Date Resolved]])","v":""},null,null,"Score",null,{"$f":"Tabla24[[#Totals],[Score]]","v":-9}]
[null,null,null,null,null,null,null,null,null,null,null,{"$f":"_xlfn.IFS(F29=\"\",\"\",M29=\"\",K29-TODAY(),M29>0,M29-F29)","v":""},null,{"$f":"_xlfn.IFS(F29=\"\",\"\",M29=\"\",\"In Progress\",M29>0,M29-F29)","v":""},"",{"$f":"IF(Tabla24[[#This Row],[Date Resolved]]=\"\",\"\",Tabla24[[#This Row],[Critical Date]]-Tabla24[[#This Row],[Date Resolved]])","v":""},null,null,"Roadblock Removal Average",null,{"$f":"IFERROR(AVERAGE(Tabla24[RR]),\"None\")","v":9}]
[null,null,null,null,null,null,null,null,null,null,null,{"$f":"_xlfn.IFS(F30=\"\",\"\",M30=\"\",K30-TODAY(),M30>0,M30-F30)","v":""},null,{"$f":"_xlfn.IFS(F30=\"\",\"\",M30=\"\",\"In Progress\",M30>0,M30-F30)","v":""},"",{"$f":"IF(Tabla24[[#This Row],[Date Resolved]]=\"\",\"\",Tabla24[[#This Row],[Critical Date]]-Tabla24[[#This Row],[Date Resolved]])","v":""}]
[null,null,null,null,null,null,null,null,null,null,null,{"$f":"_xlfn.IFS(F31=\"\",\"\",M31=\"\",K31-TODAY(),M31>0,M31-F31)","v":""},null,{"$f":"_xlfn.IFS(F31=\"\",\"\",M31=\"\",\"In Progress\",M31>0,M31-F31)","v":""},"",{"$f":"IF(Tabla24[[#This Row],[Date Resolved]]=\"\",\"\",Tabla24[[#This Row],[Critical Date]]-Tabla24[[#This Row],[Date Resolved]])","v":""},null,null,"List for Who is on Point",null,"List for Classification"]
[null,null,null,null,null,null,null,null,null,null,null,{"$f":"_xlfn.IFS(F32=\"\",\"\",M32=\"\",K32-TODAY(),M32>0,M32-F32)","v":""},null,{"$f":"_xlfn.IFS(F32=\"\",\"\",M32=\"\",\"In Progress\",M32>0,M32-F32)","v":""},"",{"$f":"IF(Tabla24[[#This Row],[Date Resolved]]=\"\",\"\",Tabla24[[#This Row],[Critical Date]]-Tabla24[[#This Row],[Date Resolved]])","v":""},null,null,"Person 1",null,"General"]
[null,null,null,null,null,null,null,null,null,null,null,{"$f":"_xlfn.IFS(F33=\"\",\"\",M33=\"\",K33-TODAY(),M33>0,M33-F33)","v":""},null,{"$f":"_xlfn.IFS(F33=\"\",\"\",M33=\"\",\"In Progress\",M33>0,M33-F33)","v":""},"",{"$f":"IF(Tabla24[[#This Row],[Date Resolved]]=\"\",\"\",Tabla24[[#This Row],[Critical Date]]-Tabla24[[#This Row],[Date Resolved]])","v":""},null,null,"Person 2",null,"MEP"]
[null,null,null,null,null,null,null,null,null,null,null,{"$f":"_xlfn.IFS(F34=\"\",\"\",M34=\"\",K34-TODAY(),M34>0,M34-F34)","v":""},null,{"$f":"_xlfn.IFS(F34=\"\",\"\",M34=\"\",\"In Progress\",M34>0,M34-F34)","v":""},"",{"$f":"IF(Tabla24[[#This Row],[Date Resolved]]=\"\",\"\",Tabla24[[#This Row],[Critical Date]]-Tabla24[[#This Row],[Date Resolved]])","v":""},null,null,"Person 3",null,"Design"]
[null,null,null,null,null,null,null,null,null,null,null,{"$f":"_xlfn.IFS(F35=\"\",\"\",M35=\"\",K35-TODAY(),M35>0,M35-F35)","v":""},null,{"$f":"_xlfn.IFS(F35=\"\",\"\",M35=\"\",\"In Progress\",M35>0,M35-F35)","v":""},"",{"$f":"IF(Tabla24[[#This Row],[Date Resolved]]=\"\",\"\",Tabla24[[#This Row],[Critical Date]]-Tabla24[[#This Row],[Date Resolved]])","v":""},null,null,"Person 4",null,"Classification 4"]
[null,null,null,null,null,null,null,null,null,null,null,{"$f":"_xlfn.IFS(F36=\"\",\"\",M36=\"\",K36-TODAY(),M36>0,M36-F36)","v":""},null,{"$f":"_xlfn.IFS(F36=\"\",\"\",M36=\"\",\"In Progress\",M36>0,M36-F36)","v":""},"",{"$f":"IF(Tabla24[[#This Row],[Date Resolved]]=\"\",\"\",Tabla24[[#This Row],[Critical Date]]-Tabla24[[#This Row],[Date Resolved]])","v":""},null,null,"Person 5",null,"Classification 5"]
[null,null,null,null,null,null,null,null,null,null,null,{"$f":"_xlfn.IFS(F37=\"\",\"\",M37=\"\",K37-TODAY(),M37>0,M37-F37)","v":""},null,{"$f":"_xlfn.IFS(F37=\"\",\"\",M37=\"\",\"In Progress\",M37>0,M37-F37)","v":""},"",{"$f":"IF(Tabla24[[#This Row],[Date Resolved]]=\"\",\"\",Tabla24[[#This Row],[Critical Date]]-Tabla24[[#This Row],[Date Resolved]])","v":""},null,null,null,null,"Classification 6"]
[null,null,null,null,null,null,null,null,null,null,null,{"$f":"_xlfn.IFS(F38=\"\",\"\",M38=\"\",K38-TODAY(),M38>0,M38-F38)","v":""},null,{"$f":"_xlfn.IFS(F38=\"\",\"\",M38=\"\",\"In Progress\",M38>0,M38-F38)","v":""},"",{"$f":"IF(Tabla24[[#This Row],[Date Resolved]]=\"\",\"\",Tabla24[[#This Row],[Critical Date]]-Tabla24[[#This Row],[Date Resolved]])","v":""}]
[null,null,null,null,null,null,null,null,null,null,null,{"$f":"_xlfn.IFS(F39=\"\",\"\",M39=\"\",K39-TODAY(),M39>0,M39-F39)","v":""},null,{"$f":"_xlfn.IFS(F39=\"\",\"\",M39=\"\",\"In Progress\",M39>0,M39-F39)","v":""},"",{"$f":"IF(Tabla24[[#This Row],[Date Resolved]]=\"\",\"\",Tabla24[[#This Row],[Critical Date]]-Tabla24[[#This Row],[Date Resolved]])","v":""}]
[null,null,null,null,null,null,null,null,null,null,null,{"$f":"_xlfn.IFS(F40=\"\",\"\",M40=\"\",K40-TODAY(),M40>0,M40-F40)","v":""},null,{"$f":"_xlfn.IFS(F40=\"\",\"\",M40=\"\",\"In Progress\",M40>0,M40-F40)","v":""},"",{"$f":"IF(Tabla24[[#This Row],[Date Resolved]]=\"\",\"\",Tabla24[[#This Row],[Critical Date]]-Tabla24[[#This Row],[Date Resolved]])","v":""}]
[null,null,null,null,null,null,null,null,null,null,null,{"$f":"_xlfn.IFS(F41=\"\",\"\",M41=\"\",K41-TODAY(),M41>0,M41-F41)","v":""},null,{"$f":"_xlfn.IFS(F41=\"\",\"\",M41=\"\",\"In Progress\",M41>0,M41-F41)","v":""},"",{"$f":"IF(Tabla24[[#This Row],[Date Resolved]]=\"\",\"\",Tabla24[[#This Row],[Critical Date]]-Tabla24[[#This Row],[Date Resolved]])","v":""}]
[null,null,null,null,null,null,null,null,null,null,null,{"$f":"_xlfn.IFS(F42=\"\",\"\",M42=\"\",K42-TODAY(),M42>0,M42-F42)","v":""},null,{"$f":"_xlfn.IFS(F42=\"\",\"\",M42=\"\",\"In Progress\",M42>0,M42-F42)","v":""},"",{"$f":"IF(Tabla24[[#This Row],[Date Resolved]]=\"\",\"\",Tabla24[[#This Row],[Critical Date]]-Tabla24[[#This Row],[Date Resolved]])","v":""}]
[null,null,null,null,null,null,null,null,null,null,null,{"$f":"_xlfn.IFS(F43=\"\",\"\",M43=\"\",K43-TODAY(),M43>0,M43-F43)","v":""},null,{"$f":"_xlfn.IFS(F43=\"\",\"\",M43=\"\",\"In Progress\",M43>0,M43-F43)","v":""},"",{"$f":"IF(Tabla24[[#This Row],[Date Resolved]]=\"\",\"\",Tabla24[[#This Row],[Critical Date]]-Tabla24[[#This Row],[Date Resolved]])","v":""}]
[null,null,null,null,null,null,null,null,null,null,null,{"$f":"_xlfn.IFS(F44=\"\",\"\",M44=\"\",K44-TODAY(),M44>0,M44-F44)","v":""},null,{"$f":"_xlfn.IFS(F44=\"\",\"\",M44=\"\",\"In Progress\",M44>0,M44-F44)","v":""},"",{"$f":"IF(Tabla24[[#This Row],[Date Resolved]]=\"\",\"\",Tabla24[[#This Row],[Critical Date]]-Tabla24[[#This Row],[Date Resolved]])","v":""}]
[null,null,null,null,null,null,null,null,null,null,null,{"$f":"_xlfn.IFS(F45=\"\",\"\",M45=\"\",K45-TODAY(),M45>0,M45-F45)","v":""},null,{"$f":"_xlfn.IFS(F45=\"\",\"\",M45=\"\",\"In Progress\",M45>0,M45-F45)","v":""},"",{"$f":"IF(Tabla24[[#This Row],[Date Resolved]]=\"\",\"\",Tabla24[[#This Row],[Critical Date]]-Tabla24[[#This Row],[Date Resolved]])","v":""}]
[null,null,null,null,null,null,null,null,null,null,null,null,null,null,{"$f":"+AVERAGE(Tabla24[Score])","v":-9},{"$f":"SUBTOTAL(101,Tabla24[RR])","v":9}]

{"sheet":"Day Plan (Manual)","index":13,"n_rows":33,"n_cols":3,"rows_kept":33,"cut":false,"hidden":false,"merged":[[1,1,17,2]]}
[]
[null,"AFTERNOON FOREMAN HUDDLE\n\n1. Make the day plan: 1 - Day\n2. Review today\n3. Discuss tomorrow\n4. Fill out the day plan according to the agenda\n5. Fill out any one-off activities\n"]
[]
[]
[]
[]
[]
[]
[]
[]
[]
[]
[]
[]
[]
[]
[]
[]
[]
[]
[]
[]
[]
[]
[]
[]
[null,"SHOUT OUTS","The Concrete crew is out to a great start.  They are cleaning as they go when stripping.  | Fire Sprinkler Trade is killing it with material staging."]
[null,"FEEDBACK","Ask crews for feedback on bathrooms and lunch area…"]
[null,"SAFETY FOCUS","Biggest safety focus is being careful around stripping operations and removing all nails from wood stripped."]
[null,"PERMITS","Electrical contractor has a dig permit at South exterior starting at 8am.  Sign-off required before beginning.  | Also, Structural Steel Contractor has a hot work permit at South Stair.  No access and fire watch to stay 30 minutes later."]
[null,"WEATHER","Clear and Sunny"]
[null,"DELIVERIES","Delivery of Duct on First Floor.  Place in room designed on Logistics map."]
[null,"DAY PLAN","Fire Sprinkler is starting in Zone 1.  We have a first in place mockup inspection scheduled for Monday.  Concrete continues in Zone 2."]

{"sheet":"Crew Board","index":14,"n_rows":0,"n_cols":0,"rows_kept":0,"cut":false,"hidden":false,"merged":[]}

{"sheet":"KPIs","index":15,"n_rows":0,"n_cols":0,"rows_kept":0,"cut":false,"hidden":false,"merged":[[4,1,4,3]]}

{"sheet":"Scrum Board","index":16,"n_rows":12,"n_cols":5,"rows_kept":12,"cut":false,"hidden":false,"merged":[[3,1,3,4]]}
[]
[]
[]
[null,"TEAM SCRUM BOARD\n\n1. Any issues needing to scale to the team will be put into the backlog column\n2. What did you do yesterday?\n3. What will you do today?\n4. What is standing in your way?\n5. How can we help you?\n6. How can we make this fun?"]
[]
[]
[]
[]
[]
[]
[]
[null,"TO DO","TO DO THIS WEEK","DO TODAY","DONE"]

{"sheet":"One Floor Norm Example","index":17,"n_rows":46,"n_cols":1223,"rows_kept":46,"cut":false,"hidden":false,"merged":[[20,165,58,165],[21,149,58,149],[21,155,58,155],[11,54,27,54],[20,99,27,99],[20,105,27,105],[20,132,27,132],[20,137,27,137],[20,148,20,164]]}
[null,null,null,null,null,null,null,null,null,null,null,null,null,null,null,null,null,null,null,null,null,null,null,null,2022,null,null,null,null,null,null,null,null,null,null,null,null,null,null,null,null,null,null,null,2023,null,null,null,null,null,null,null,null,null,null,null,null,null,null,null,null,null,null,null,null,null,null,null,null,null,null,null,null,null,null,null,null,null,null,null,null,null,null,null,null,null,null,null,null,null,null,null,null,null,null,null,null,null,null,null,null,null,null,null,null,null,null,null,null,null,null,null,null,null,null,null,null,null,null,null,null,null,null,null,null,null,null,null,null,null,null,null,null,null,null,null,null,null,null,null,null,null,null,null,null,null,null,null,null,null,null,null,null,null,null,null,null,null,null,null,null,null,null,null,null,null,null,null,null,null,null,null,null,null,null,null,null,null,2024,null,null,null,null,null,null,null,null,null,null,null,null,null,null,null,null,null,null,null,null,null,null,null,null,null,null,null,null,null,null,null,null,null,null,null,null,null,null,null,null,null,null,null,null,null,null,null,null,null,null,null,null,null,null,null,null,null,null,null,null,null,null,null,null,null,null,null,null,null,null,null,null,null,null,null,null,null,null,null,null,null,null,null,null,null,null,null,null,null,null,null,null,null,null,null,null,null,null,null,null,null,null,null,null,null,null,null,null,null,null,null,null,null,null,null,null,null,null,null,null,null,null,null,null,null,null,null,null,null,null,null,null,null,null,null,null,null,null,null,null,null,null,null,null,null,null,null,null,null,null,null,null,null,null,null,null,null,null,null,null,null,null,null,null,null,null,null,null,null,null,null,null,null,null,null,null,null,null,null,null,null,null,null,null,null,null,null,null,null,null,null,null,null,null,null,null,null,null,null,null,null,null,null,null,null,null,null,null,null,null,null,null,null,null,null,null,null,null,null,null,null,null,null,null,null,null,null,null,null,null,null,null,null,null,null,null,null,null,null,null,null,null,null,null,null,null,null,null,null,null,null,null,null,null,null,null,null,null,null,null,null,2025,null,null,null,null,null,null,null,null,null,null,null,null,null,null,null,null,null,null,null,null,null,null,null,null,null,null,null,null,null,null,null,null,null,null,null,null,null,null,null,null,null,null,null,null,null,null,null,null,null,null,null,null,null,null,null,null,null,null,null,null,null,null,null,null,null,null,null,null,null,null,null,null,null,null,null,null,null,null,null,null,null,null,null,null,null,null,null,null,null,null,null,null,null,null,null,null,null,null,null,null,null,null,null,null,null,null,null,null,null,null,null,null,null,null,null,null,null,null,null,null,null,null,null,null,null,null,null,null,null,null,null,null,null,null,null,null,null,null,null,null,null,null,null,null,null,null,null,null,null,null,null,null,null,null,null,null,null,null,null,null,null,null,null,null,null,null,null,null,null,null,null,null,null,null,null,null,null,null,null,null,null,null,null,null,null,null,null,null,null,null,null,null,null,null,null,null,null,null,null,null,null,null,null,null,null,null,null,null,null,null,null,null,null,null,null,null,null,null,null,null,null,null,null,null,null,null,null,null,null,null,null,null,null,null,null,null,null,null,null,null,null,null,null,null,null,null,null,null,null,null,null,null,null,null,null,null,null,null,null,null,2026,null,null,null,null,null,null,null,null,null,null,null,null,null,null,null,null,null,null,null,null,null,null,null,null,null,null,null,null,null,null,null,null,null,null,null,null,null,null,null,null,null,null,null,null,null,null,null,null,null,null,null,null,null,null,null,null,null,null,null,null,null,null,null,null,null,null,null,null,null,null,null,null,null,null,null,null,null,null,null,null,null,null,null,null,null,null,null,null,null,null,null,null,null,null,null,null,null,null,null,null,null,null,null,null,null,null,null,null,null,null,null,null,null,null,null,null,null,null,null,null,null,null,null,null,null,null,null,null,null,null,null,null,null,null,null,null,null,null,null,null,null,null,null,null,null,null,null,null,null,null,null,null,null,null,null,null,null,null,null,null,null,null,null,null,null,null,null,null,null,null,null,null,null,null,null,null,null,null,null,null,null,null,null,null,null,null,null,null,null,null,null,null,null,null,null,null,null,null,null,null,null,null,null,null,null,null,null,null,null,null,null,null,null,null,null,null,null,null,null,null,null,null,null,null,null,null,null,null,null,null,null,null,null,null,null,null,null,null,null,null,null,null,null,null,null,null,null,null,null,null,null,null,null,null,null,null,null,null,null,null,2027]
[null,null,null,null,null,null,null,null,null,null,null,null,null,null,null,null,null,null,null,null,null,null,null,null,"December",null,null,null,null,null,null,null,null,null,null,null,null,null,null,null,null,null,null,null,"January",null,null,null,null,null,null,null,null,null,null,null,null,null,null,null,null,null,null,null,null,null,"February",null,null,null,null,null,null,null,null,null,null,null,null,null,null,null,null,null,null,null,"March",null,null,null,null,null,null,null,null,null,null,null,null,null,null,null,null,null,null,null,null,null,null,"April",null,null,null,null,null,null,null,null,null,null,null,null,null,null,null,null,null,null,null,"May",null,null,null,null,null,null,null,null,null,null,null,null,null,null,null,null,null,null,null,null,null,null,"June",null,null,null,null,null,null,null,null,null,null,null,null,null,null,null,null,null,null,null,null,null,null,null,null,null,"January",null,null,null,null,null,null,null,null,null,null,null,null,null,null,null,null,null,null,null,null,null,null,"February",null,null,null,null,null,null,null,null,null,null,null,null,null,null,null,null,null,null,null,null,"March",null,null,null,null,null,null,null,null,null,null,null,null,null,null,null,null,null,null,null,null,"April",null,null,null,null,null,null,null,null,null,null,null,null,null,null,null,null,null,null,null,null,null,"May",null,null,null,null,null,null,null,null,null,null,null,null,null,null,null,null,null,null,null,null,null,null,"June",null,null,null,null,null,null,null,null,null,null,null,null,null,null,null,null,null,null,null,"July",null,null,null,null,null,null,null,null,null,null,null,null,null,null,null,null,null,null,null,null,null,null,"August",null,null,null,null,null,null,null,null,null,null,null,null,null,null,null,null,null,null,null,null,null,"September",null,null,null,null,null,null,null,null,null,null,null,null,null,null,null,null,null,null,null,null,"October",null,null,null,null,null,null,null,null,null,null,null,null,null,null,null,null,null,null,null,null,null,null,"November",null,null,null,null,null,null,null,null,null,null,null,null,null,null,null,null,null,null,null,null,"December",null,null,null,null,null,null,null,null,null,null,null,null,null,null,null,null,null,null,null,null,null,"January",null,null,null,null,null,null,null,null,null,null,null,null,null,null,null,null,null,null,null,null,null,null,"February",null,null,null,null,null,null,null,null,null,null,null,null,null,null,null,null,null,null,null,"March",null,null,null,null,null,null,null,null,null,null,null,null,null,null,null,null,null,null,null,null,"April",null,null,null,null,null,null,null,null,null,null,null,null,null,null,null,null,null,null,null,null,null,"May",null,null,null,null,null,null,null,null,null,null,null,null,null,null,null,null,null,null,null,null,null,"June",null,null,null,null,null,null,null,null,null,null,null,null,null,null,null,null,null,null,null,null,"July",null,null,null,null,null,null,null,null,null,null,null,null,null,null,null,null,null,null,null,null,null,null,"August",null,null,null,null,null,null,null,null,null,null,null,null,null,null,null,null,null,null,null,null,"September",null,null,null,null,null,null,null,null,null,null,null,null,null,null,null,null,null,null,null,null,null,"October",null,null,null,null,null,null,null,null,null,null,null,null,null,null,null,null,null,null,null,null,null,null,"November",null,null,null,null,null,null,null,null,null,null,null,null,null,null,null,null,null,null,null,"December",null,null,null,null,null,null,null,null,null,null,null,null,null,null,null,null,null,null,null,null,null,null,"January",null,null,null,null,null,null,null,null,null,null,null,null,null,null,null,null,null,null,null,null,null,"February",null,null,null,null,null,null,null,null,null,null,null,null,null,null,null,null,null,null,null,"March",null,null,null,null,null,null,null,null,null,null,null,null,null,null,null,null,null,null,null,null,null,"April",null,null,null,null,null,null,null,null,null,null,null,null,null,null,null,null,null,null,null,null,null,"May",null,null,null,null,null,null,null,null,null,null,null,null,null,null,null,null,null,null,null,null,"June",null,null,null,null,null,null,null,null,null,null,null,null,null,null,null,null,null,null,null,null,null,"July",null,null,null,null,null,null,null,null,null,null,null,null,null,null,null,null,null,null,null,null,null,null,"August",null,null,null,null,null,null,null,null,null,null,null,null,null,null,null,null,null,null,null,null,"September",null,null,null,null,null,null,null,null,null,null,null,null,null,null,null,null,null,null,null,null,null,"October",null,null,null,null,null,null,null,null,null,null,null,null,null,null,null,null,null,null,null,null,null,"November",null,null,null,null,null,null,null,null,null,null,null,null,null,null,null,null,null,null,null,null,"December",null,null,null,null,null,null,null,null,null,null,null,null,null,null,null,null,null,null,null,null,null,null,"January",null,null,null,null,null,null,null,null,null,null,null,null,null,null,null,null,null,null,null,null,null,"February",null,null,null,null,null,null,null,null,null,null,null,null,null,null,null,null,null,null,null,"March",null,null,null,null,null,null,null,null,null,null,null,null,null,null,null,null,null,null,null,null,null,"April",null,null,null,null,null,null,null,null,null,null,null,null,null,null,null,null,null,null,null,null,null,"May",null,null,null,null,null,null,null,null,null,null,null,null,null,null,null,null,null,null,null,null,"June",null,null,null,null,null,null,null,null,null,null,null,null,null,null,null,null,null,null,null,null,null,"July",null,null,null,null,null,null,null,null,null,null,null,null,null,null,null,null,null,null,null,null,null,null,"August",null,null,null,null,null,null,null,null,null,null,null,null,null,null,null,null,null,null,null,null,"September",null,null,null,null,null,null,null,null,null,null,null,null,null,null,null,null,null,null,null,null,null,"October",null,null,null,null,null,null,null,null,null,null,null,null,null,null,null,null,null,null,null,null,null,"November",null,null,null,null,null,null,null,null,null,null,null,null,null,null,null,null,null,null,null,null,"December"]
[null,null,null,null,null,null,null,null,null,null,null,null,null,null,null,null,null,null,null,null,null,null,null,null,"2022-12-05","2022-12-06","2022-12-07","2022-12-08","2022-12-09","2022-12-12","2022-12-13","2022-12-14","2022-12-15","2022-12-16","2022-12-19","2022-12-20","2022-12-21","2022-12-22","2022-12-23","2022-12-26","2022-12-27","2022-12-28","2022-12-29","2022-12-30","2023-01-02","2023-01-03","2023-01-04","2023-01-05","2023-01-06","2023-01-09","2023-01-10","2023-01-11","2023-01-12","2023-01-13","2023-01-16","2023-01-17","2023-01-18","2023-01-19","2023-01-20","2023-01-23","2023-01-24","2023-01-25","2023-01-26","2023-01-27","2023-01-30","2023-01-31","2023-02-01","2023-02-02","2023-02-03","2023-02-06","2023-02-07","2023-02-08","2023-02-09","2023-02-10","2023-02-13","2023-02-14","2023-02-15","2023-02-16","2023-02-17","2023-02-20","2023-02-21","2023-02-22","2023-02-23","2023-02-24","2023-02-27","2023-02-28","2023-03-01","2023-03-02","2023-03-03","2023-03-06","2023-03-07","2023-03-08","2023-03-09","2023-03-10","2023-03-13","2023-03-14","2023-03-15","2023-03-16","2023-03-17","2023-03-20","2023-03-21","2023-03-22","2023-03-23","2023-03-24","2023-03-27","2023-03-28","2023-03-29","2023-03-30","2023-03-31","2023-04-03","2023-04-04","2023-04-05","2023-04-06","2023-04-07","2023-04-10","2023-04-11","2023-04-12","2023-04-13","2023-04-14","2023-04-17","2023-04-18","2023-04-19","2023-04-20","2023-04-21","2023-04-24","2023-04-25","2023-04-26","2023-04-27","2023-04-28","2023-05-01","2023-05-02","2023-05-03","2023-05-04","2023-05-05","2023-05-08","2023-05-09","2023-05-10","2023-05-11","2023-05-12","2023-05-15","2023-05-16","2023-05-17","2023-05-18","2023-05-19","2023-05-22","2023-05-23","2023-05-24","2023-05-25","2023-05-26","2023-05-29","2023-05-30","2023-05-31","2023-06-01","2023-06-02","2023-06-05","2023-06-06","2023-06-07","2023-06-08","2023-06-09","2023-06-12","2023-06-13","2023-06-14","2023-06-15","2023-06-16","2023-06-19","2023-06-20","2023-06-21","2023-06-22","2023-06-23","2023-06-26","2023-06-27","2023-06-28","2023-06-29","2023-06-30",null,null,null,null,"2024-01-01","2024-01-02","2024-01-03","2024-01-04","2024-01-05","2024-01-08","2024-01-09","2024-01-10","2024-01-11","2024-01-12","2024-01-15","2024-01-16","2024-01-17","2024-01-18","2024-01-19","2024-01-22","2024-01-23","2024-01-24","2024-01-25","2024-01-26","2024-01-29","2024-01-30","2024-01-31","2024-02-01","2024-02-02","2024-02-05","2024-02-06","2024-02-07","2024-02-08","2024-02-09","2024-02-12","2024-02-13","2024-02-14","2024-02-15","2024-02-16","2024-02-19","2024-02-20","2024-02-21","2024-02-22","2024-02-23","2024-02-26","2024-02-27","2024-02-28","2024-02-29","2024-03-01","2024-03-04","2024-03-05","2024-03-06","2024-03-07","2024-03-08","2024-03-11","2024-03-12","2024-03-13","2024-03-14","2024-03-15","2024-03-18","2024-03-19","2024-03-20","2024-03-21","2024-03-22","2024-03-25","2024-03-26","2024-03-27","2024-03-28","2024-03-29","2024-04-01","2024-04-02","2024-04-03","2024-04-04","2024-04-05","2024-04-08","2024-04-09","2024-04-10","2024-04-11","2024-04-12","2024-04-15","2024-04-16","2024-04-17","2024-04-18","2024-04-19","2024-04-22","2024-04-23","2024-04-24","2024-04-25","2024-04-26","2024-04-29","2024-04-30","2024-05-01","2024-05-02","2024-05-03","2024-05-06","2024-05-07","2024-05-08","2024-05-09","2024-05-10","2024-05-13","2024-05-14","2024-05-15","2024-05-16","2024-05-17","2024-05-20","2024-05-21","2024-05-22","2024-05-23","2024-05-24","2024-05-27","2024-05-28","2024-05-29","2024-05-30","2024-05-31","2024-06-03","2024-06-04","2024-06-05","2024-06-06","2024-06-07","2024-06-10","2024-06-11","2024-06-12","2024-06-13","2024-06-14","2024-06-17","2024-06-18","2024-06-19","2024-06-20","2024-06-21","2024-06-24","2024-06-25","2024-06-26","2024-06-27","2024-06-28","2024-07-01","2024-07-02","2024-07-03","2024-07-04","2024-07-05","2024-07-08","2024-07-09","2024-07-10","2024-07-11","2024-07-12","2024-07-15","2024-07-16","2024-07-17","2024-07-18","2024-07-19","2024-07-22","2024-07-23","2024-07-24","2024-07-25","2024-07-26","2024-07-29","2024-07-30","2024-07-31","2024-08-01","2024-08-02","2024-08-05","2024-08-06","2024-08-07","2024-08-08","2024-08-09","2024-08-12","2024-08-13","2024-08-14","2024-08-15","2024-08-16","2024-08-19","2024-08-20","2024-08-21","2024-08-22","2024-08-23","2024-08-26","2024-08-27","2024-08-28","2024-08-29","2024-08-30","2024-09-02","2024-09-03","2024-09-04","2024-09-05","2024-09-06","2024-09-09","2024-09-10","2024-09-11","2024-09-12","2024-09-13","2024-09-16","2024-09-17","2024-09-18","2024-09-19","2024-09-20","2024-09-23","2024-09-24","2024-09-25","2024-09-26","2024-09-27","2024-09-30","2024-10-01","2024-10-02","2024-10-03","2024-10-04","2024-10-07","2024-10-08","2024-10-09","2024-10-10","2024-10-11","2024-10-14","2024-10-15","2024-10-16","2024-10-17","2024-10-18","2024-10-21","2024-10-22","2024-10-23","2024-10-24","2024-10-25","2024-10-28","2024-10-29","2024-10-30","2024-10-31","2024-11-01","2024-11-04","2024-11-05","2024-11-06","2024-11-07","2024-11-08","2024-11-11","2024-11-12","2024-11-13","2024-11-14","2024-11-15","2024-11-18","2024-11-19","2024-11-20","2024-11-21","2024-11-22","2024-11-25","2024-11-26","2024-11-27","2024-11-28","2024-11-29","2024-12-02","2024-12-03","2024-12-04","2024-12-05","2024-12-06","2024-12-09","2024-12-10","2024-12-11","2024-12-12","2024-12-13","2024-12-16","2024-12-17","2024-12-18","2024-12-19","2024-12-20","2024-12-23","2024-12-24","2024-12-25","2024-12-26","2024-12-27","2024-12-30","2024-12-31","2025-01-01","2025-01-02","2025-01-03","2025-01-06","2025-01-07","2025-01-08","2025-01-09","2025-01-10","2025-01-13","2025-01-14","2025-01-15","2025-01-16","2025-01-17","2025-01-20","2025-01-21","2025-01-22","2025-01-23","2025-01-24","2025-01-27","2025-01-28","2025-01-29","2025-01-30","2025-01-31","2025-02-03","2025-02-04","2025-02-05","2025-02-06","2025-02-07","2025-02-10","2025-02-11","2025-02-12","2025-02-13","2025-02-14","2025-02-17","2025-02-18","2025-02-19","2025-02-20","2025-02-21","2025-02-24","2025-02-25","2025-02-26","2025-02-27","2025-02-28","2025-03-03","2025-03-04","2025-03-05","2025-03-06","2025-03-07","2025-03-10","2025-03-11","2025-03-12","2025-03-13","2025-03-14","2025-03-17","2025-03-18","2025-03-19","2025-03-20","2025-03-21","2025-03-24","2025-03-25","2025-03-26","2025-03-27","2025-03-28","2025-03-31","2025-04-01","2025-04-02","2025-04-03","2025-04-04","2025-04-07","2025-04-08","2025-04-09","2025-04-10","2025-04-11","2025-04-14","2025-04-15","2025-04-16","2025-04-17","2025-04-18","2025-04-21","2025-04-22","2025-04-23","2025-04-24","2025-04-25","2025-04-28","2025-04-29","2025-04-30","2025-05-01","2025-05-02","2025-05-05","2025-05-06","2025-05-07","2025-05-08","2025-05-09","2025-05-12","2025-05-13","2025-05-14","2025-05-15","2025-05-16","2025-05-19","2025-05-20","2025-05-21","2025-05-22","2025-05-23","2025-05-26","2025-05-27","2025-05-28","2025-05-29","2025-05-30","2025-06-02","2025-06-03","2025-06-04","2025-06-05","2025-06-06","2025-06-09","2025-06-10","2025-06-11","2025-06-12","2025-06-13","2025-06-16","2025-06-17","2025-06-18","2025-06-19","2025-06-20","2025-06-23","2025-06-24","2025-06-25","2025-06-26","2025-06-27","2025-06-30","2025-07-01","2025-07-02","2025-07-03","2025-07-04","2025-07-07","2025-07-08","2025-07-09","2025-07-10","2025-07-11","2025-07-14","2025-07-15","2025-07-16","2025-07-17","2025-07-18","2025-07-21","2025-07-22","2025-07-23","2025-07-24","2025-07-25","2025-07-28","2025-07-29","2025-07-30","2025-07-31","2025-08-01","2025-08-04","2025-08-05","2025-08-06","2025-08-07","2025-08-08","2025-08-11","2025-08-12","2025-08-13","2025-08-14","2025-08-15","2025-08-18","2025-08-19","2025-08-20","2025-08-21","2025-08-22","2025-08-25","2025-08-26","2025-08-27","2025-08-28","2025-08-29","2025-09-01","2025-09-02","2025-09-03","2025-09-04","2025-09-05","2025-09-08","2025-09-09","2025-09-10","2025-09-11","2025-09-12","2025-09-15","2025-09-16","2025-09-17","2025-09-18","2025-09-19","2025-09-22","2025-09-23","2025-09-24","2025-09-25","2025-09-26","2025-09-29","2025-09-30","2025-10-01","2025-10-02","2025-10-03","2025-10-06","2025-10-07","2025-10-08","2025-10-09","2025-10-10","2025-10-13","2025-10-14","2025-10-15","2025-10-16","2025-10-17","2025-10-20","2025-10-21","2025-10-22","2025-10-23","2025-10-24","2025-10-27","2025-10-28","2025-10-29","2025-10-30","2025-10-31","2025-11-03","2025-11-04","2025-11-05","2025-11-06","2025-11-07","2025-11-10","2025-11-11","2025-11-12","2025-11-13","2025-11-14","2025-11-17","2025-11-18","2025-11-19","2025-11-20","2025-11-21","2025-11-24","2025-11-25","2025-11-26","2025-11-27","2025-11-28","2025-12-01","2025-12-02","2025-12-03","2025-12-04","2025-12-05","2025-12-08","2025-12-09","2025-12-10","2025-12-11","2025-12-12","2025-12-15","2025-12-16","2025-12-17","2025-12-18","2025-12-19","2025-12-22","2025-12-23","2025-12-24","2025-12-25","2025-12-26","2025-12-29","2025-12-30","2025-12-31","2026-01-01","2026-01-02","2026-01-05","2026-01-06","2026-01-07","2026-01-08","2026-01-09","2026-01-12","2026-01-13","2026-01-14","2026-01-15","2026-01-16","2026-01-19","2026-01-20","2026-01-21","2026-01-22","2026-01-23","2026-01-26","2026-01-27","2026-01-28","2026-01-29","2026-01-30","2026-02-02","2026-02-03","2026-02-04","2026-02-05","2026-02-06","2026-02-09","2026-02-10","2026-02-11","2026-02-12","2026-02-13","2026-02-16","2026-02-17","2026-02-18","2026-02-19","2026-02-20","2026-02-23","2026-02-24","2026-02-25","2026-02-26","2026-02-27","2026-03-02","2026-03-03","2026-03-04","2026-03-05","2026-03-06","2026-03-09","2026-03-10","2026-03-11","2026-03-12","2026-03-13","2026-03-16","2026-03-17","2026-03-18","2026-03-19","2026-03-20","2026-03-23","2026-03-24","2026-03-25","2026-03-26","2026-03-27","2026-03-30","2026-03-31","2026-04-01","2026-04-02","2026-04-03","2026-04-06","2026-04-07","2026-04-08","2026-04-09","2026-04-10","2026-04-13","2026-04-14","2026-04-15","2026-04-16","2026-04-17","2026-04-20","2026-04-21","2026-04-22","2026-04-23","2026-04-24","2026-04-27","2026-04-28","2026-04-29","2026-04-30","2026-05-01","2026-05-04","2026-05-05","2026-05-06","2026-05-07","2026-05-08","2026-05-11","2026-05-12","2026-05-13","2026-05-14","2026-05-15","2026-05-18","2026-05-19","2026-05-20","2026-05-21","2026-05-22","2026-05-25","2026-05-26","2026-05-27","2026-05-28","2026-05-29","2026-06-01","2026-06-02","2026-06-03","2026-06-04","2026-06-05","2026-06-08","2026-06-09","2026-06-10","2026-06-11","2026-06-12","2026-06-15","2026-06-16","2026-06-17","2026-06-18","2026-06-19","2026-06-22","2026-06-23","2026-06-24","2026-06-25","2026-06-26","2026-06-29","2026-06-30","2026-07-01","2026-07-02","2026-07-03","2026-07-06","2026-07-07","2026-07-08","2026-07-09","2026-07-10","2026-07-13","2026-07-14","2026-07-15","2026-07-16","2026-07-17","2026-07-20","2026-07-21","2026-07-22","2026-07-23","2026-07-24","2026-07-27","2026-07-28","2026-07-29","2026-07-30","2026-07-31","2026-08-03","2026-08-04","2026-08-05","2026-08-06","2026-08-07","2026-08-10","2026-08-11","2026-08-12","2026-08-13","2026-08-14","2026-08-17","2026-08-18","2026-08-19","2026-08-20","2026-08-21","2026-08-24","2026-08-25","2026-08-26","2026-08-27","2026-08-28","2026-08-31","2026-09-01","2026-09-02","2026-09-03","2026-09-04","2026-09-07","2026-09-08","2026-09-09","2026-09-10","2026-09-11","2026-09-14","2026-09-15","2026-09-16","2026-09-17","2026-09-18","2026-09-21","2026-09-22","2026-09-23","2026-09-24","2026-09-25","2026-09-28","2026-09-29","2026-09-30","2026-10-01","2026-10-02","2026-10-05","2026-10-06","2026-10-07","2026-10-08","2026-10-09","2026-10-12","2026-10-13","2026-10-14","2026-10-15","2026-10-16","2026-10-19","2026-10-20","2026-10-21","2026-10-22","2026-10-23","2026-10-26","2026-10-27","2026-10-28","2026-10-29","2026-10-30","2026-11-02","2026-11-03","2026-11-04","2026-11-05","2026-11-06","2026-11-09","2026-11-10","2026-11-11","2026-11-12","2026-11-13","2026-11-16","2026-11-17","2026-11-18","2026-11-19","2026-11-20","2026-11-23","2026-11-24","2026-11-25","2026-11-26","2026-11-27","2026-11-30","2026-12-01","2026-12-02","2026-12-03","2026-12-04","2026-12-07","2026-12-08","2026-12-09","2026-12-10","2026-12-11","2026-12-14","2026-12-15","2026-12-16","2026-12-17","2026-12-18","2026-12-21","2026-12-22","2026-12-23","2026-12-24","2026-12-25","2026-12-28","2026-12-29","2026-12-30","2026-12-31","2027-01-01","2027-01-04","2027-01-05","2027-01-06","2027-01-07","2027-01-08","2027-01-11","2027-01-12","2027-01-13","2027-01-14","2027-01-15","2027-01-18","2027-01-19","2027-01-20","2027-01-21","2027-01-22","2027-01-25","2027-01-26","2027-01-27","2027-01-28","2027-01-29","2027-02-01","2027-02-02","2027-02-03","2027-02-04","2027-02-05","2027-02-08","2027-02-09","2027-02-10","2027-02-11","2027-02-12","2027-02-15","2027-02-16","2027-02-17","2027-02-18","2027-02-19","2027-02-22","2027-02-23","2027-02-24","2027-02-25","2027-02-26","2027-03-01","2027-03-02","2027-03-03","2027-03-04","2027-03-05","2027-03-08","2027-03-09","2027-03-10","2027-03-11","2027-03-12","2027-03-15","2027-03-16","2027-03-17","2027-03-18","2027-03-19","2027-03-22","2027-03-23","2027-03-24","2027-03-25","2027-03-26","2027-03-29","2027-03-30","2027-03-31","2027-04-01","2027-04-02","2027-04-05","2027-04-06","2027-04-07","2027-04-08","2027-04-09","2027-04-12","2027-04-13","2027-04-14","2027-04-15","2027-04-16","2027-04-19","2027-04-20","2027-04-21","2027-04-22","2027-04-23","2027-04-26","2027-04-27","2027-04-28","2027-04-29","2027-04-30","2027-05-03","2027-05-04","2027-05-05","2027-05-06","2027-05-07","2027-05-10","2027-05-11","2027-05-12","2027-05-13","2027-05-14","2027-05-17","2027-05-18","2027-05-19","2027-05-20","2027-05-21","2027-05-24","2027-05-25","2027-05-26","2027-05-27","2027-05-28","2027-05-31","2027-06-01","2027-06-02","2027-06-03","2027-06-04","2027-06-07","2027-06-08","2027-06-09","2027-06-10","2027-06-11","2027-06-14","2027-06-15","2027-06-16","2027-06-17","2027-06-18","2027-06-21","2027-06-22","2027-06-23","2027-06-24","2027-06-25","2027-06-28","2027-06-29","2027-06-30","2027-07-01","2027-07-02","2027-07-05","2027-07-06","2027-07-07","2027-07-08","2027-07-09","2027-07-12","2027-07-13","2027-07-14","2027-07-15","2027-07-16","2027-07-19","2027-07-20","2027-07-21","2027-07-22","2027-07-23","2027-07-26","2027-07-27","2027-07-28","2027-07-29","2027-07-30","2027-08-02","2027-08-03","2027-08-04","2027-08-05","2027-08-06","2027-08-09","2027-08-10","2027-08-11","2027-08-12","2027-08-13","2027-08-16","2027-08-17","2027-08-18","2027-08-19","2027-08-20","2027-08-23","2027-08-24","2027-08-25","2027-08-26","2027-08-27","2027-08-30","2027-08-31","2027-09-01","2027-09-02","2027-09-03","2027-09-06","2027-09-07","2027-09-08","2027-09-09","2027-09-10","2027-09-13","2027-09-14","2027-09-15","2027-09-16","2027-09-17","2027-09-20","2027-09-21","2027-09-22","2027-09-23","2027-09-24","2027-09-27","2027-09-28","2027-09-29","2027-09-30","2027-10-01","2027-10-04","2027-10-05","2027-10-06","2027-10-07","2027-10-08","2027-10-11","2027-10-12","2027-10-13","2027-10-14","2027-10-15","2027-10-18","2027-10-19","2027-10-20","2027-10-21","2027-10-22","2027-10-25","2027-10-26","2027-10-27","2027-10-28","2027-10-29","2027-11-01","2027-11-02","2027-11-03","2027-11-04","2027-11-05","2027-11-08","2027-11-09","2027-11-10","2027-11-11","2027-11-12","2027-11-15","2027-11-16","2027-11-17","2027-11-18","2027-11-19","2027-11-22","2027-11-23","2027-11-24","2027-11-25","2027-11-26","2027-11-29","2027-11-30","2027-12-01","2027-12-02","2027-12-03","2027-12-06","2027-12-07","2027-12-08","2027-12-09","2027-12-10","2027-12-13","2027-12-14","2027-12-15","2027-12-16","2027-12-17","2027-12-20","2027-12-21","2027-12-22","2027-12-23","2027-12-24","2027-12-27","2027-12-28","2027-12-29","2027-12-30","2027-12-31"]
[null,null,null,null,null,null,null,null,null,null,null,null,null,null,null,null,null,null,null,null,null,null,null,null,"M","T","W","TH","F","M","T","W","TH","F","M","T","W","TH","F","M","T","W","TH","F","M","T","W","TH","F","M","T","W","TH","F","M","T","W","TH","F","M","T","W","TH","F","M","T","W","TH","F","M","T","W","TH","F","M","T","W","TH","F","M","T","W","TH","F","M","T","W","TH","F","M","T","W","TH","F","M","T","W","TH","F","M","T","W","TH","F","M","T","W","TH","F","M","T","W","TH","F","M","T","W","TH","F","M","T","W","TH","F","M","T","W","TH","F","M","T","W","TH","F","M","T","W","TH","F","M","T","W","TH","F","M","T","W","TH","F","M","T","W","TH","F","M","T","W","TH","F","M","T","W","TH","F","M","T","W","TH","F","M","T","W","TH","F",null,null,null,null,"M","T","W","TH","F","M","T","W","TH","F","M","T","W","TH","F","M","T","W","TH","F","M","T","W","TH","F","M","T","W","TH","F","M","T","W","TH","F","M","T","W","TH","F","M","T","W","TH","F","M","T","W","TH","F","M","T","W","TH","F","M","T","W","TH","F","M","T","W","TH","F","M","T","W","TH","F","M","T","W","TH","F","M","T","W","TH","F","M","T","W","TH","F","M","T","W","TH","F","M","T","W","TH","F","M","T","W","TH","F","M","T","W","TH","F","M","T","W","TH","F","M","T","W","TH","F","M","T","W","TH","F","M","T","W","TH","F","M","T","W","TH","F","M","T","W","TH","F","M","T","W","TH","F","M","T","W","TH","F","M","T","W","TH","F","M","T","W","TH","F","M","T","W","TH","F","M","T","W","TH","F","M","T","W","TH","F","M","T","W","TH","F","M","T","W","TH","F","M","T","W","TH","F","M","T","W","TH","F","M","T","W","TH","F","M","T","W","TH","F","M","T","W","TH","F","M","T","W","TH","F","M","T","W","TH","F","M","T","W","TH","F","M","T","W","TH","F","M","T","W","TH","F","M","T","W","TH","F","M","T","W","TH","F","M","T","W","TH","F","M","T","W","TH","F","M","T","W","TH","F","M","T","W","TH","F","M","T","W","TH","F","M","T","W",{"$f":"+IF($A$7=\"SW\",\"TO\",\"TH\")","v":"TH"},"F","M","T","W",{"$f":"+IF($A$7=\"SW\",\"TO\",\"TH\")","v":"TH"},"F","M","T","W",{"$f":"+IF($A$7=\"SW\",\"TO\",\"TH\")","v":"TH"},"F","M","T","W",{"$f":"+IF($A$7=\"SW\",\"TO\",\"TH\")","v":"TH"},"F","M","T","W",{"$f":"+IF($A$7=\"SW\",\"TO\",\"TH\")","v":"TH"},"F","M","T","W",{"$f":"+IF($A$7=\"SW\",\"TO\",\"TH\")","v":"TH"},"F","M","T","W",{"$f":"+IF($A$7=\"SW\",\"TO\",\"TH\")","v":"TH"},"F","M","T","W",{"$f":"+IF($A$7=\"SW\",\"TO\",\"TH\")","v":"TH"},"F","M","T","W",{"$f":"+IF($A$7=\"SW\",\"TO\",\"TH\")","v":"TH"},"F","M","T","W",{"$f":"+IF($A$7=\"SW\",\"TO\",\"TH\")","v":"TH"},"F","M","T","W",{"$f":"+IF($A$7=\"SW\",\"TO\",\"TH\")","v":"TH"},"F","M","T","W",{"$f":"+IF($A$7=\"SW\",\"TO\",\"TH\")","v":"TH"},"F","M","T","W",{"$f":"+IF($A$7=\"SW\",\"TO\",\"TH\")","v":"TH"},"F","M","T","W",{"$f":"+IF($A$7=\"SW\",\"TO\",\"TH\")","v":"TH"},"F","M","T","W",{"$f":"+IF($A$7=\"SW\",\"TO\",\"TH\")","v":"TH"},"F","M","T","W",{"$f":"+IF($A$7=\"SW\",\"TO\",\"TH\")","v":"TH"},"F","M","T","W",{"$f":"+IF($A$7=\"SW\",\"TO\",\"TH\")","v":"TH"},"F","M","T","W",{"$f":"+IF($A$7=\"SW\",\"TO\",\"TH\")","v":"TH"},"F","M","T","W",{"$f":"+IF($A$7=\"SW\",\"TO\",\"TH\")","v":"TH"},"F","M","T","W",{"$f":"+IF($A$7=\"SW\",\"TO\",\"TH\")","v":"TH"},"F","M","T","W",{"$f":"+IF($A$7=\"SW\",\"TO\",\"TH\")","v":"TH"},"F","M","T","W",{"$f":"+IF($A$7=\"SW\",\"TO\",\"TH\")","v":"TH"},"F","M","T","W",{"$f":"+IF($A$7=\"SW\",\"TO\",\"TH\")","v":"TH"},"F","M","T","W",{"$f":"+IF($A$7=\"SW\",\"TO\",\"TH\")","v":"TH"},"F","M","T","W",{"$f":"+IF($A$7=\"SW\",\"TO\",\"TH\")","v":"TH"},"F","M","T","W",{"$f":"+IF($A$7=\"SW\",\"TO\",\"TH\")","v":"TH"},"F","M","T","W",{"$f":"+IF($A$7=\"SW\",\"TO\",\"TH\")","v":"TH"},"F","M","T","W",{"$f":"+IF($A$7=\"SW\",\"TO\",\"TH\")","v":"TH"},"F","M","T","W",{"$f":"+IF($A$7=\"SW\",\"TO\",\"TH\")","v":"TH"},"F","M","T","W",{"$f":"+IF($A$7=\"SW\",\"TO\",\"TH\")","v":"TH"},"F","M","T","W",{"$f":"+IF($A$7=\"SW\",\"TO\",\"TH\")","v":"TH"},"F","M","T","W",{"$f":"+IF($A$7=\"SW\",\"TO\",\"TH\")","v":"TH"},"F","M","T","W",{"$f":"+IF($A$7=\"SW\",\"TO\",\"TH\")","v":"TH"},"F","M","T","W",{"$f":"+IF($A$7=\"SW\",\"TO\",\"TH\")","v":"TH"},"F","M","T","W",{"$f":"+IF($A$7=\"SW\",\"TO\",\"TH\")","v":"TH"},"F","M","T","W",{"$f":"+IF($A$7=\"SW\",\"TO\",\"TH\")","v":"TH"},"F","M","T","W",{"$f":"+IF($A$7=\"SW\",\"TO\",\"TH\")","v":"TH"},"F","M","T","W",{"$f":"+IF($A$7=\"SW\",\"TO\",\"TH\")","v":"TH"},"F","M","T","W",{"$f":"+IF($A$7=\"SW\",\"TO\",\"TH\")","v":"TH"},"F","M","T","W",{"$f":"+IF($A$7=\"SW\",\"TO\",\"TH\")","v":"TH"},"F","M","T","W",{"$f":"+IF($A$7=\"SW\",\"TO\",\"TH\")","v":"TH"},"F","M","T","W",{"$f":"+IF($A$7=\"SW\",\"TO\",\"TH\")","v":"TH"},"F","M","T","W",{"$f":"+IF($A$7=\"SW\",\"TO\",\"TH\")","v":"TH"},"F","M","T","W",{"$f":"+IF($A$7=\"SW\",\"TO\",\"TH\")","v":"TH"},"F","M","T","W",{"$f":"+IF($A$7=\"SW\",\"TO\",\"TH\")","v":"TH"},"F","M","T","W",{"$f":"+IF($A$7=\"SW\",\"TO\",\"TH\")","v":"TH"},"F","M","T","W",{"$f":"+IF($A$7=\"SW\",\"TO\",\"TH\")","v":"TH"},"F","M","T","W",{"$f":"+IF($A$7=\"SW\",\"TO\",\"TH\")","v":"TH"},"F","M","T","W",{"$f":"+IF($A$7=\"SW\",\"TO\",\"TH\")","v":"TH"},"F","M","T","W",{"$f":"+IF($A$7=\"SW\",\"TO\",\"TH\")","v":"TH"},"F","M","T","W",{"$f":"+IF($A$7=\"SW\",\"TO\",\"TH\")","v":"TH"},"F","M","T","W",{"$f":"+IF($A$7=\"SW\",\"TO\",\"TH\")","v":"TH"},"F","M","T","W",{"$f":"+IF($A$7=\"SW\",\"TO\",\"TH\")","v":"TH"},"F","M","T","W",{"$f":"+IF($A$7=\"SW\",\"TO\",\"TH\")","v":"TH"},"F","M","T","W",{"$f":"+IF($A$7=\"SW\",\"TO\",\"TH\")","v":"TH"},"F","M","T","W",{"$f":"+IF($A$7=\"SW\",\"TO\",\"TH\")","v":"TH"},"F","M","T","W",{"$f":"+IF($A$7=\"SW\",\"TO\",\"TH\")","v":"TH"},"F","M","T","W",{"$f":"+IF($A$7=\"SW\",\"TO\",\"TH\")","v":"TH"},"F","M","T","W",{"$f":"+IF($A$7=\"SW\",\"TO\",\"TH\")","v":"TH"},"F","M","T","W",{"$f":"+IF($A$7=\"SW\",\"TO\",\"TH\")","v":"TH"},"F","M","T","W",{"$f":"+IF($A$7=\"SW\",\"TO\",\"TH\")","v":"TH"},"F","M","T","W",{"$f":"+IF($A$7=\"SW\",\"TO\",\"TH\")","v":"TH"},"F","M","T","W",{"$f":"+IF($A$7=\"SW\",\"TO\",\"TH\")","v":"TH"},"F","M","T","W",{"$f":"+IF($A$7=\"SW\",\"TO\",\"TH\")","v":"TH"},"F","M","T","W",{"$f":"+IF($A$7=\"SW\",\"TO\",\"TH\")","v":"TH"},"F","M","T","W",{"$f":"+IF($A$7=\"SW\",\"TO\",\"TH\")","v":"TH"},"F","M","T","W",{"$f":"+IF($A$7=\"SW\",\"TO\",\"TH\")","v":"TH"},"F","M","T","W",{"$f":"+IF($A$7=\"SW\",\"TO\",\"TH\")","v":"TH"},"F","M","T","W",{"$f":"+IF($A$7=\"SW\",\"TO\",\"TH\")","v":"TH"},"F","M","T","W",{"$f":"+IF($A$7=\"SW\",\"TO\",\"TH\")","v":"TH"},"F","M","T","W",{"$f":"+IF($A$7=\"SW\",\"TO\",\"TH\")","v":"TH"},"F","M","T","W",{"$f":"+IF($A$7=\"SW\",\"TO\",\"TH\")","v":"TH"},"F","M","T","W",{"$f":"+IF($A$7=\"SW\",\"TO\",\"TH\")","v":"TH"},"F","M","T","W",{"$f":"+IF($A$7=\"SW\",\"TO\",\"TH\")","v":"TH"},"F","M","T","W",{"$f":"+IF($A$7=\"SW\",\"TO\",\"TH\")","v":"TH"},"F","M","T","W",{"$f":"+IF($A$7=\"SW\",\"TO\",\"TH\")","v":"TH"},"F","M","T","W",{"$f":"+IF($A$7=\"SW\",\"TO\",\"TH\")","v":"TH"},"F","M","T","W",{"$f":"+IF($A$7=\"SW\",\"TO\",\"TH\")","v":"TH"},"F","M","T","W",{"$f":"+IF($A$7=\"SW\",\"TO\",\"TH\")","v":"TH"},"F","M","T","W",{"$f":"+IF($A$7=\"SW\",\"TO\",\"TH\")","v":"TH"},"F","M","T","W",{"$f":"+IF($A$7=\"SW\",\"TO\",\"TH\")","v":"TH"},"F","M","T","W",{"$f":"+IF($A$7=\"SW\",\"TO\",\"TH\")","v":"TH"},"F","M","T","W",{"$f":"+IF($A$7=\"SW\",\"TO\",\"TH\")","v":"TH"},"F","M","T","W",{"$f":"+IF($A$7=\"SW\",\"TO\",\"TH\")","v":"TH"},"F","M","T","W",{"$f":"+IF($A$7=\"SW\",\"TO\",\"TH\")","v":"TH"},"F","M","T","W",{"$f":"+IF($A$7=\"SW\",\"TO\",\"TH\")","v":"TH"},"F","M","T","W",{"$f":"+IF($A$7=\"SW\",\"TO\",\"TH\")","v":"TH"},"F","M","T","W",{"$f":"+IF($A$7=\"SW\",\"TO\",\"TH\")","v":"TH"},"F","M","T","W",{"$f":"+IF($A$7=\"SW\",\"TO\",\"TH\")","v":"TH"},"F","M","T","W",{"$f":"+IF($A$7=\"SW\",\"TO\",\"TH\")","v":"TH"},"F","M","T","W",{"$f":"+IF($A$7=\"SW\",\"TO\",\"TH\")","v":"TH"},"F","M","T","W",{"$f":"+IF($A$7=\"SW\",\"TO\",\"TH\")","v":"TH"},"F","M","T","W",{"$f":"+IF($A$7=\"SW\",\"TO\",\"TH\")","v":"TH"},"F","M","T","W",{"$f":"+IF($A$7=\"SW\",\"TO\",\"TH\")","v":"TH"},"F","M","T","W",{"$f":"+IF($A$7=\"SW\",\"TO\",\"TH\")","v":"TH"},"F","M","T","W",{"$f":"+IF($A$7=\"SW\",\"TO\",\"TH\")","v":"TH"},"F","M","T","W",{"$f":"+IF($A$7=\"SW\",\"TO\",\"TH\")","v":"TH"},"F","M","T","W",{"$f":"+IF($A$7=\"SW\",\"TO\",\"TH\")","v":"TH"},"F","M","T","W",{"$f":"+IF($A$7=\"SW\",\"TO\",\"TH\")","v":"TH"},"F","M","T","W",{"$f":"+IF($A$7=\"SW\",\"TO\",\"TH\")","v":"TH"},"F","M","T","W",{"$f":"+IF($A$7=\"SW\",\"TO\",\"TH\")","v":"TH"},"F","M","T","W",{"$f":"+IF($A$7=\"SW\",\"TO\",\"TH\")","v":"TH"},"F","M","T","W",{"$f":"+IF($A$7=\"SW\",\"TO\",\"TH\")","v":"TH"},"F","M","T","W",{"$f":"+IF($A$7=\"SW\",\"TO\",\"TH\")","v":"TH"},"F","M","T","W",{"$f":"+IF($A$7=\"SW\",\"TO\",\"TH\")","v":"TH"},"F","M","T","W",{"$f":"+IF($A$7=\"SW\",\"TO\",\"TH\")","v":"TH"},"F","M","T","W",{"$f":"+IF($A$7=\"SW\",\"TO\",\"TH\")","v":"TH"},"F","M","T","W",{"$f":"+IF($A$7=\"SW\",\"TO\",\"TH\")","v":"TH"},"F","M","T","W",{"$f":"+IF($A$7=\"SW\",\"TO\",\"TH\")","v":"TH"},"F","M","T","W",{"$f":"+IF($A$7=\"SW\",\"TO\",\"TH\")","v":"TH"},"F","M","T","W","TH","F","M","T","W","TH","F","M","T","W","TH","F","M","T","W","TH","F","M","T","W","TH","F","M","T","W","TH","F","M","T","W","TH","F","M","T","W","TH","F","M","T","W","TH","F","M","T","W","TH","F","M","T","W","TH","F","M","T","W","TH","F","M","T","W","TH","F","M","T","W","TH","F","M","T","W","TH","F","M","T","W","TH","F","M","T","W","TH","F","M","T","W","TH","F","M","T","W","TH","F","M","T","W","TH","F","M","T","W","TH","F","M","T","W","TH","F","M","T","W","TH","F","M","T","W","TH","F","M","T","W","TH","F","M","T","W","TH","F","M","T","W","TH","F","M","T","W","TH","F","M","T","W","TH","F","M","T","W","TH","F","M","T","W","TH","F","M","T","W","TH","F","M","T","W","TH","F","M","T","W","TH","F","M","T","W","TH","F","M","T","W","TH","F","M","T","W","TH","F","M","T","W","TH","F","M","T","W","TH","F","M","T","W","TH","F","M","T","W","TH","F","M","T","W","TH","F","M","T","W","TH","F","M","T","W","TH","F","M","T","W","TH","F","M","T","W","TH","F"]
[]
[]
[]
[]
[]
[null,null,null,null,null,null,null,null,null,null,null,null,null,null,null,null,null,null,null,null,null,null,null,null,null,null,null,null,null,null,null,null,null,null,null,null,null,null,null,null,null,null,null,null,null,null,null,null,null,null,null,null,null,null,"Zone 1",1,1,1,2,2,2,"B","B","B",3,3,3,4,4,4,5,5,5,6,6,6,7,7,7,8,8,8,"B","B","B",9,9,9,10,10,10,"B","B","B","B",11,11,11,"B","B","B",12,12,12,13,13,13,14,14,14,15,15,15]
[null,null,null,null,null,null,null,null,null,null,null,null,null,null,null,null,null,null,null,null,null,null,null,null,null,null,null,null,null,null,null,null,null,null,null,null,null,null,null,null,null,null,null,null,null,null,null,null,null,null,null,null,null,null,null,null,null,"Zone 2",1,1,1,2,2,2,"B","B","B",3,3,3,4,4,4,5,5,5,6,6,6,7,7,7,8,8,8,"B","B","B",9,9,9,"B","B","B","B",10,10,10,11,11,11,"B","B","B",12,12,12,13,13,13,14,14,14,"B","B","B","B",15,15,15]
[null,null,null,null,null,null,null,null,null,null,null,null,null,null,null,null,null,null,null,null,null,null,null,null,null,null,null,null,null,null,null,null,null,null,1,"Remove re-shores, Floor Prep, Final Patch Ceiling & Layout Walls",null,null,null,null,null,null,null,null,null,null,null,null,null,null,null,null,null,null,"Remove Reshores",null,null,null,null,null,"Zone 3",1,1,1,2,2,2,"B","B","B",3,3,3,4,4,4,5,5,5,6,6,6,7,7,7,8,8,8,"B","B","B","B","B","B","B",9,9,9,10,10,10,11,11,11,"B","B","B",12,12,12,13,13,13,"B","B","B","B",14,14,14,15,15,15]
[null,null,null,null,null,null,null,null,null,null,null,null,null,null,null,null,null,null,null,null,null,null,null,null,null,null,null,null,null,null,null,null,null,null,2,"Install Fire Sprinkler Main and Branch Lines & Install Priority Walls",null,null,null,null,null,null,null,null,null,null,null,null,null,null,null,null,null,null,null,null,null,null,null,null,null,null,null,"Zone 4",1,1,1,2,2,2,"B","B","B",3,3,3,4,4,4,5,5,5,6,6,6,7,7,7,8,8,8,"B","B","B","B","B","B","B",9,9,9,10,10,10,11,11,11,"B","B","B",12,12,12,"B","B","B","B",13,13,13,14,14,14,15,15,15]
[null,null,null,null,null,null,null,null,null,null,null,null,null,null,null,null,null,null,null,null,null,null,null,null,null,null,null,null,null,null,null,null,null,null,3,"OH Mechanical ",null,null,null,null,null,null,null,null,null,null,null,null,null,null,null,null,null,null,null,null,null,null,null,null,null,null,null,null,null,null,"Zone 5",1,1,1,2,2,2,"B","B","B",3,3,3,4,4,4,5,5,5,6,6,6,7,7,7,"B","B","B","B",8,8,8,"B","B","B",9,9,9,10,10,10,11,11,11,"B","B","B","B","B","B","B",12,12,12,13,13,13,14,14,14,15,15,15]
[null,null,null,null,null,null,null,null,null,null,null,null,null,null,null,null,null,null,null,null,null,null,null,null,null,null,null,null,null,null,null,null,null,null,4,"OH Mechanical, OH Plumbing",null,null,null,null,null,null,null,null,null,null,null,null,null,null,null,null,null,null,null,null,null,null,null,null,null,null,null,null,null,null,null,null,null,"Zone 6",1,1,1,2,2,2,"B","B","B",3,3,3,4,4,4,5,5,5,6,6,6,"B","B","B","B",7,7,7,8,8,8,"B","B","B",9,9,9,10,10,10,11,11,11,"B","B","B","B","B","B","B",12,12,12,13,13,13,14,14,14,15,15,15]
[null,null,null,null,null,null,null,null,null,null,null,null,null,null,null,null,null,null,null,null,null,null,null,null,null,null,null,null,null,null,null,null,null,null,5,"OH Electrical & Frame Walls",null,null,null,null,null,null,null,null,null,null,null,null,null,null,null,null,null,null,null,null,null,null,null,null,null,null,null,null,null,null,null,null,null,null,null,null,"Zone 7",1,1,1,2,2,2,"B","B","B",3,3,3,4,4,4,5,5,5,"B","B","B","B",6,6,6,7,7,7,8,8,8,"B","B","B",9,9,9,10,10,10,"B","B","B","B",11,11,11,"B","B","B",12,12,12,13,13,13,14,14,14,15,15,15]
[null,null,null,null,null,null,null,null,null,null,null,null,null,null,null,null,null,null,null,null,null,null,null,null,null,null,null,null,null,null,null,null,null,null,6,"In-wall Electrical & Plumbing",null,null,null,null,null,null,null,null,null,null,null,null,null,null,null,null,null,null,null,null,null,null,null,null,null,null,null,null,null,null,null,null,null,null,null,null,null,null,null,"Zone 8",1,1,1,2,2,2,"B","B","B",3,3,3,4,4,4,"B","B","B","B",5,5,5,6,6,6,7,7,7,8,8,8,"B","B","B",9,9,9,"B","B","B","B",10,10,10,11,11,11,"B","B","B",12,12,12,13,13,13,14,14,14,15,15,15]
[null,null,null,null,null,null,null,null,null,null,null,null,null,null,null,null,null,null,null,null,null,null,null,null,null,null,null,null,null,null,null,null,null,null,7,"In-wall Piping, One-side Dry Wall & In-wall Inspection",null,null,null,null,null,null,null,null,null,null,null,null,null,null,null,null,null,null,null,null,null,null,null,null,null,null,null,null,null,null,null,null,null,null,null,null,null,null,null,null,null,null,"Zone 9",1,1,1,2,2,2,"B","B","B",3,3,3,"B","B","B","B",4,4,4,5,5,5,6,6,6,7,7,7,8,8,8,"B","B","B","B","B","B","B",9,9,9,10,10,10,11,11,11,"B","B","B",12,12,12,13,13,13,14,14,14,15,15,15]
[null,null,null,null,null,null,null,null,null,null,null,null,null,null,null,null,null,null,null,null,null,null,null,null,null,null,null,null,null,null,null,null,null,null,8,"Second Side Dry Wall, Insulation & Finish Walls",null,null,null,null,null,null,null,null,null,null,null,null,null,null,null,null,null,null,null,null,null,null,null,null,null,null,null,null,null,null,null,null,null,null,null,null,null,null,null,null,null,null,null,null,null,"Zone 10",1,1,1,2,2,2,"B","B","B","B","B","B","B",3,3,3,4,4,4,5,5,5,6,6,6,7,7,7,8,8,8,"B","B","B","B","B","B","B",9,9,9,10,10,10,11,11,11,"B","B","B",12,12,12,13,13,13,14,14,14,15,15,15]
[null,null,null,null,null,null,null,null,null,null,null,null,null,null,null,null,null,null,null,null,null,null,null,null,null,null,null,null,null,null,null,null,null,null,9,"Prime 1st & 2nd Coat Paint",null,null,null,null,null,null,null,null,null,null,null,null,null,null,null,null,null,null,null,null,null,null,null,null,null,null,null,null,null,null,null,null,null,null,null,null,null,null,null,null,null,null,null,null,null,null,null,null,"Zone 11",1,1,1,2,2,2,"B","B","B","B","B","B","B",3,3,3,4,4,4,5,5,5,6,6,6,7,7,7,"B","B","B","B",8,8,8,"B","B","B",9,9,9,10,10,10,11,11,11,"B","B","B",12,12,12,13,13,13,14,14,14,15,15,15,"B","B","B","B","B","B","B","B","B","B","B","B","B","B","B","B","B","B"]
[null,null,null,null,null,null,null,null,null,null,null,null,null,null,null,null,null,null,null,null,null,null,null,null,null,null,null,null,null,null,null,null,null,null,10,"Ceiling Grid, Lights, Electrical Fixtures & Mechanical Ceiling Drops",null,null,null,null,null,null,null,null,null,null,null,null,null,null,null,null,null,null,null,null,null,null,null,null,null,null,null,null,null,null,null,null,null,null,null,null,null,null,null,null,null,null,null,null,null,null,null,null,null,null,null,null,null,null,null,null,null,null,null,null,null,null,null,"Start Drywall",null,null,null,null,null,"Power On ",null,null,null,null,null,null,null,null,null,null,null,null,null,null,null,null,null,null,null,null,null,null,null,null,null,null,"Air On ",null,null,null,null,"Fianal Clean",null,null,null,null,null,null,null,null,null,null,"Additional Buffer or Time Gained",null,null,null,null,null,null,null,null,null,null,null,null,null,null,null,null,"Contractual Substantial Completion and Financial Target"]
[null,null,null,null,null,null,null,null,null,null,null,null,null,null,null,null,null,null,null,null,null,null,null,null,null,null,null,null,null,null,null,null,null,null,11,"Casework & Final Pain (Possible)",null,null,null,null,null,null,null,null,null,null,null,null,null,null,null,null,null,null,null,null,null,null,null,null,null,null,null,null,null,null,null,null,null,null,null,null,null,null,null,null,null,null,null,null,null,null,null,null,null,null,null,null,null,null,null,null,null,null,null,null,null,null,null,null,null,null,null,null,null,null,null,null,null,null,null,null,null,null,null,null,null,null,null,null,null,null,null,null,null,null,null,null,null,null,null,null,null,null,null,null,null,null,null,null,null,null,null,null,null,null,null,null,null,"Target Substantial Completion",null,null,null,null,null,"Target Final Completion"]
[null,null,null,null,null,null,null,null,null,null,null,null,null,null,null,null,null,null,null,null,null,null,null,null,null,null,null,null,null,null,null,null,null,null,12,"Millwork, Plumbing, Wall and Casework, Ceiling Tiles",null,null,null,null,null,null,null,null,null,null,null,null,null,null,null,null,null,null,null,null,null,null,null,null,null,null,null,null,"Erect Stair"]
[null,null,null,null,null,null,null,null,null,null,null,null,null,null,null,null,null,null,null,null,null,null,null,null,null,null,null,null,null,null,null,null,null,null,13,"Flooring",null,null,null,null,null,null,null,null,null,null,null,null,null,null,null,null,null,null,null,null,null,null,null,null,null,null,null,null,null,null,null,null,"Pour Stair Pans"]
[null,null,null,null,null,null,null,null,null,null,null,null,null,null,null,null,null,null,null,null,null,null,null,null,null,null,null,null,null,null,null,null,null,null,14,"Final Paint, Final Clean 1st Pass & Incomplete Worklist",null,null,null,null,null,null,null,null,null,null,null,null,null,null,null,null,null,null,null,null,null,null,null,null,null,null,null,null,null,null,null,null,null,null,null,null,null,"Erect Stair"]
[null,null,null,null,null,null,null,null,null,null,null,null,null,null,null,null,null,null,null,null,null,null,null,null,null,null,null,null,null,null,null,null,null,null,15,"Arch Punchlist, Corrections & Final Clean",null,null,null,null,null,null,null,null,null,null,null,null,null,null,null,null,null,null,null,null,null,null,null,null,null,null,null,null,null,null,null,null,null,null,null,null,null,null,null,null,null,"Pour Stair Pans"]
[]
[]
[]
[null,null,null,null,null,null,null,null,null,null,null,null,null,null,null,null,null,null,null,null,null,null,null,null,null,null,null,null,null,null,null,null,null,null,null,null,null,null,null,null,null,null,null,null,null,null,null,null,null,null,null,null,null,null,null,null,null,null,null,null,null,null,null,null,null,null,null,null,null,null,null,null,null,null,null,null,null,null,null,null,null,null,null,null,null,null,null,null,null,null,null,null,null,null,null,null,null,null,null,"Temp Roof",null,null,null,null,"Install Swing Stages"]
[null,null,null,null,null,null,null,null,null,null,null,null,null,null,null,null,null,null,null,null,null,null,null,null,null,null,null,null,null,null,null,null,null,null,null,null,null,null,null,null,null,null,null,null,null,null,null,null,null,null,null,null,null,null,null,null,null,null,null,null,null,null,null,null,null,null,null,null,null,null,null,null,null,null,null,null,null,null,null,null,null,null,null,null,null,null,null,null,null,null,null,null,null,null,null,null,null,null,null,null,null,null,null,null,null,null,null,null,"Set AHU & Install"]
[null,null,null,null,null,null,null,null,null,null,null,null,null,null,null,null,null,null,null,null,null,null,null,null,null,null,null,null,null,null,null,null,null,null,null,null,null,null,null,null,null,null,null,null,null,null,null,null,null,null,null,null,null,null,null,null,null,null,null,null,null,null,null,null,null,null,null,null,null,null,null,null,null,null,null,null,null,null,null,null,null,null,null,null,null,null,null,null,null,null,null,null,null,null,null,null,null,null,null,null,null,null,null,null,null,null,null,null,null,null,null,null,null,null,null,"Zone 1-4"]
[null,null,null,null,null,null,null,null,null,null,null,null,null,null,null,null,null,null,null,null,null,null,null,null,null,null,null,null,null,null,null,null,null,null,null,"Weather Risk",null,null,null,null,null,null,null,3,null,null,null,null,null,null,null,null,null,null,null,null,null,null,null,null,null,null,null,null,null,null,null,null,null,null,null,null,null,null,null,null,null,null,null,null,null,null,null,null,null,null,null,null,null,null,null,null,null,null,null,null,null,null,null,null,null,null,null,null,null,null,null,null,null,null,null,null,null,null,null,null,null,null,null,null,null,"Zone 5-8"]
[null,null,null,null,null,null,null,null,null,null,null,null,null,null,null,null,null,null,null,null,null,null,null,null,null,null,null,null,null,null,null,null,null,null,null,"Manpower not available",null,null,null,null,null,null,null,5,null,null,null,null,null,null,null,null,null,null,null,null,null,null,null,null,null,null,null,null,null,null,null,null,null,null,null,null,null,null,null,null,null,null,null,null,null,null,null,null,null,null,null,null,null,null,null,null,null,null,null,null,null,null,null,null,null,null,null,null,null,null,null,null,null,null,null,null,null,null,null,null,null,null,null,null,null,null,null,null,null,null,null,"Zone 9-11"]
[null,null,null,null,null,null,null,null,null,null,null,null,null,null,null,null,null,null,null,null,null,null,null,null,null,null,null,null,null,null,null,null,null,null,null,"Procurement Issues",null,null,null,null,null,null,null,5,null,null,null,null,null,null,null,null,null,null,null,null,null,null,null,null,null,null,null,null,null,null,null,null,null,null,null,null,null,null,null,null,null,null,null,null,null,null,null,null,null,null,null,null,null,null,null,null,null,null,null,null,null,null,null,null,null,null,null,null,null,null,null,null,null,null,null,null,null,null,null,null,null,null,null,null,null,null,null,null,null,null,null,"B","B","B","B","B"]
[null,null,null,null,null,null,null,null,null,null,null,null,null,null,null,null,null,null,null,null,null,null,null,null,null,null,null,null,null,null,null,null,null,null,null,"Shortage in crew",null,null,null,null,null,null,null,2]
[null,null,null,null,null,null,null,null,null,null,null,null,null,null,null,null,null,null,null,null,null,null,null,null,null,null,null,null,null,null,null,null,null,null,null,"Contractor labor not ready",null,null,null,null,null,null,null,8,null,null,null,null,null,null,null,null,null,null,null,null,null,null,null,null,null,null,null,null,null,null,null,null,null,null,null,null,null,null,null,null,"Shaft Prep"]
[null,null,null,null,null,null,null,null,null,null,null,null,null,null,null,null,null,null,null,null,null,null,null,null,null,null,null,null,null,null,null,null,null,null,null,"Higher risk",null,null,null,null,null,null,null,{"$f":"+MAX(AR33:AR37)","v":8},null,null,null,null,null,null,null,null,null,null,null,null,null,null,null,null,null,null,null,null,null,null,null,null,null,null,null,null,null,null,null,null,null,null,null,null,"Elevator Cabs"]
[null,null,null,null,null,null,null,null,null,null,null,null,null,null,null,null,null,null,null,null,null,null,null,null,null,null,null,null,null,null,null,null,null,null,null,null,null,null,null,null,null,null,null,null,null,null,null,null,null,null,null,null,null,null,null,null,null,null,null,null,null,null,null,null,null,null,null,null,null,null,null,null,null,null,null,null,null,null,null,null,null,null,null,null,null,null,null,null,null,null,null,null,null,null,null,null,null,null,null,null,null,null,null,null,"Test + Certification"]
[]
[null,null,null,null,null,null,null,null,null,null,null,null,null,null,null,null,null,null,null,null,null,null,null,null,null,null,null,null,null,null,null,null,null,null,null,null,null,null,null,null,null,null,null,null,null,null,null,null,null,null,null,null,null,null,null,null,null,null,null,null,null,null,null,null,null,null,null,null,null,null,null,null,null,null,null,null,null,null,null,null,null,null,null,null,null,null,null,null,null,null,null,null,null,null,null,null,null,null,null,null,null,null,null,null,null,null,null,"Pre-Functional Checklists"]
[null,null,null,null,null,null,null,null,null,null,null,null,null,null,null,null,null,null,null,null,null,null,null,null,null,null,null,null,null,null,null,null,null,null,null,null,null,null,null,null,null,null,null,null,null,null,null,null,null,null,null,null,null,null,null,null,null,null,null,null,null,null,null,null,null,null,null,null,null,null,null,null,null,null,null,null,null,null,null,null,null,null,null,null,null,null,null,null,null,null,null,null,null,null,null,null,null,null,null,null,null,null,null,null,null,null,null,null,null,null,null,null,null,null,null,null,null,null,null,null,null,"Controls"]
[null,null,null,null,null,null,null,null,null,null,null,null,null,null,null,null,null,null,null,null,null,null,null,null,null,null,null,null,null,null,null,null,null,null,null,null,null,null,null,null,null,null,null,null,null,null,null,null,null,null,null,null,null,null,null,null,null,null,null,null,null,null,null,null,null,null,null,null,null,null,null,null,null,null,null,null,null,null,null,null,null,null,null,null,null,null,null,null,null,null,null,null,null,null,null,null,null,null,null,null,null,null,null,null,null,null,null,null,null,null,null,null,null,null,null,null,null,null,null,null,null,null,null,null,null,null,"TAB"]
[null,null,null,null,null,null,null,null,null,null,null,null,null,null,null,null,null,null,null,null,null,null,null,null,null,null,null,null,null,null,null,null,null,null,null,null,null,null,null,null,null,null,null,null,null,null,null,null,null,null,null,null,null,null,null,null,null,null,null,null,null,null,null,null,null,null,null,null,null,null,null,null,null,null,null,null,null,null,null,null,null,null,null,null,null,null,null,null,null,null,null,null,null,null,null,null,null,null,null,null,null,null,null,null,null,null,null,null,null,null,null,null,null,null,null,null,null,null,null,null,null,null,null,null,null,null,null,null,null,null,null,null,null,null,null,"Commissioning"]
[null,null,null,null,null,null,null,null,null,null,null,null,null,null,null,null,null,null,null,null,null,null,null,null,null,null,null,null,null,null,null,null,null,null,null,null,null,null,null,null,null,null,null,null,null,null,null,null,null,null,null,null,null,null,null,null,null,null,null,null,null,null,null,null,null,null,null,null,null,null,null,null,null,null,null,null,null,null,null,null,null,null,null,null,null,null,null,null,null,null,null,null,null,null,null,null,null,null,null,null,null,null,null,null,null,null,null,null,null,null,null,null,null,null,null,null,null,null,null,null,null,null,null,null,null,null,null,null,null,null,null,null,null,null,null,null,null,null,"Fire Life Safety"]
[null,null,null,null,null,null,null,null,null,null,null,null,null,null,null,null,null,null,null,null,null,null,null,null,null,null,null,null,null,null,null,null,null,null,null,null,null,null,null,null,null,null,null,null,null,null,null,null,null,null,null,null,null,null,null,null,null,null,null,null,null,null,null,null,null,null,null,null,null,null,null,null,null,null,null,null,null,null,null,null,null,null,null,null,null,null,null,null,null,null,null,null,null,null,null,null,null,null,null,null,null,null,null,null,null,null,null,null,null,null,null,null,null,null,null,null,null,null,null,null,null,null,null,null,null,null,null,null,null,null,null,null,null,null,null,null,null,null,null,null,null,null,"Final Walks"]

{"sheet":"Legend","index":18,"n_rows":62,"n_cols":25,"rows_kept":62,"cut":false,"hidden":true,"merged":[]}
[]
[null,null,null,null,null,"NORM LEGEND"]
["Code","Phase","Trade Partner","Description"]
["1H","Beginning Sitework Work","Earthwork","Excavation/Grading"]
["1I","Beginning Sitework Work","Utilities","Install Storm/Sanitary/Water/Dry U.G. Utilities",null,null,"BEGINNING SITEWORK WORK",null,null,null,null,null,null,null,null,null,null,null,null,null,null,null,null,"EXTERIOR LEGEND"]
["1J","Beginning Sitework Work","Earthwork","Parking Area Base Stone",null,null,"1H","Excavation/Grading",null,null,null,null,null,null,null,null,null,null,null,null,null,null,null,"A","Structural Steel Supports"]
["1K","Beginning Sitework Work","Earthwork","Final Grading",null,null,"1I","Install Storm/Sanitary/Water/Dry U.G. Utilities",null,null,null,null,null,null,null,null,null,null,null,null,null,null,null,"B","Framing & Sheathing"]
["F1","Foundation","Concrete","Excavate & Pour Footings",null,null,"1J","Parking Area Base Stone",null,null,null,null,null,null,null,null,null,null,null,null,null,null,null,"C","EIFS"]
["F2","Foundation","Concrete","Columns & Walls",null,null,"1K","Final Grading",null,null,null,null,null,null,null,null,null,null,null,null,null,null,null,"D","Window Installation"]
["F3","Foundation","MEP","UG MEP",null,null,null,null,null,null,null,null,null,null,null,null,null,null,null,null,null,null,null,"E","Final Caulking & Finishes"]
["F4","Foundation","Concrete","SOG",null,null,null,null,null,null,null,null,null,null,null,null,null,null,null,null,null,null,null,"F","Shade Structure"]
["B","Foundation","TBD","Buffer"]
["S1","Structure","Concrete","Deck Formwork",null,null,"FOUNDATION LEGEND"]
["S2","Structure","MEP","Deck MEP & Reinforcing",null,null,"F1","Excavate & Pour Footings"]
["S3","Structure","Inspector","Deck Inspections & Place",null,null,"F2","Columns & Walls"]
["S4","Structure","Concrete","Columns & Walls",null,null,"F3","UG MEP",null,null,null,null,null,null,null,null,null,null,null,null,null,null,null,"FINISHING SITEWORK LEGEND"]
["S5","Stairs & Elevator","Stairs","Erect Stair ",null,null,"F4","SOG",null,null,null,null,null,null,null,null,null,null,null,null,null,null,null,1,"Site Demoblization"]
["C","Stairs & Elevator","Concrete","Pour Concrete",null,null,"B.","Buffer",null,null,null,null,null,null,null,null,null,null,null,null,null,null,null,2,"UG Electrical"]
["S6","Stairs & Elevator","Concrete","Shaft Prep",null,null,null,null,null,null,null,null,null,null,null,null,null,null,null,null,null,null,null,3,"Rough Grading"]
["S7","Stairs & Elevator","Elevator","Elevator Cabs",null,null,null,null,null,null,null,null,null,null,null,null,null,null,null,null,null,null,null,4,"Hardscaping"]
["S8","Stairs & Elevator","Elevator","Certification",null,null,null,null,null,null,null,null,null,null,null,null,null,null,null,null,null,null,null,5,"Trees & Irrigation"]
["S9","Stairs & Elevator","Elevator","Comeback Areas for Elevator",null,null,"INTERIOR LEGEND",null,null,null,null,null,null,null,null,null,null,null,null,null,null,null,null,6,"Landscaping"]
[1,"Interiors","Flooring","Remove Reshores, Floor Prep & Wall Layout",null,null,1,"Remove Reshores, Floor Prep & Wall Layout",null,null,null,null,null,null,null,null,null,null,null,null,null,null,null,7,"Paving"]
[2,"Interiors","Sprinkler","Fire Sprinkler & Install Walls",null,null,2,"Fire Sprinkler & Install Walls",null,null,null,null,null,null,null,null,null,null,null,null,null,null,null,8,"Site Finishes"]
[3,"Interiors","Mechanical","OH Mechanical Duct",null,null,3,"OH Mechanical Duct"]
[4,"Interiors","Mechanical","OH Mech Equip, Piping, Branch Lines & Plumbing",null,null,4,"OH Mech Equip, Piping, Branch Lines & Plumbing"]
[5,"Interiors","Electrical","OH Electrical & Frame Walls",null,null,5,"OH Electrical & Frame Walls"]
[6,"Interiors","Electrical","Frame Walls, Install In-wall Electrical & Plumbing",null,null,6,"Frame Walls, Install In-wall Electrical & Plumbing",null,null,null,null,null,null,null,null,null,null,null,null,null,null,null,"STRUCTURE LEGEND"]
[7,"Interiors","Plumbing","In-wall Process Piping, 1st Drywall, Insulation & Insp",null,null,7,"In-wall Process Piping, 1st Drywall, Insulation & Insp",null,null,null,null,null,null,null,null,null,null,null,null,null,null,null,"S1","Deck Formwork"]
[8,"Interiors","Painting","Finish Walls & Painting",null,null,8,"Finish Walls & Painting",null,null,null,null,null,null,null,null,null,null,null,null,null,null,null,"S2","Deck MEP & Reinforcing"]
[9,"Interiors","Electrical","Painting & Install Ceiling Grid",null,null,9,"Painting & Install Ceiling Grid",null,null,null,null,null,null,null,null,null,null,null,null,null,null,null,"S3","Deck Inspections & Place"]
[10,"Interiors","Drywall","Install Electrical Fixtures & Mech Ceiling Drops",null,null,10,"Install Electrical Fixtures & Mech Ceiling Drops",null,null,null,null,null,null,null,null,null,null,null,null,null,null,null,"S4","Columns & Walls"]
[11,"Interiors","Mechanical","Remaining Ceiling Drops & Install Casework",null,null,11,"Remaining Ceiling Drops & Install Casework"]
[12,"Interiors","Countertops","Countertops, Millwork & Final Paint",null,null,12,"Countertops, Millwork & Final Paint"]
[13,"Interiors","Electrical & Flooring","Wall & Casework Fixtures, Ceiling Tiles & Flooring",null,null,13,"Wall & Casework Fixtures, Ceiling Tiles & Flooring"]
[14,"Interiors","Flooring & Painting","Flooring, Final Paint & 1st Clean",null,null,14,"Flooring, Final Paint & 1st Clean"]
[15,"Interiors","Contruction Company","Punchlist, Corrections & Final Clean",null,null,15,"Punchlist, Corrections & Final Clean"]
[16,"Commissioning","HVAC","Set AHU"]
[17,"Commissioning","HVAC","Mechanical Installation"]
[18,"Commissioning","HVAC","Controls"]
[19,"Commissioning","HVAC","Point to Point"]
[20,"Commissioning","HVAC","Mech Startup"]
[21,"Commissioning","HVAC","Pre-functional Checklists"]
[22,"Commissioning","HVAC","Controls"]
[23,"Commissioning","HVAC","TAB"]
[24,"Commissioning","HVAC","Cx + FA Testing"]
[25,"Commissioning","HVAC","LS/ FA Testing"]
[26,"Commissioning","HVAC","Functional Performance Testing"]
["A","Exteriors","Steel","Structural Steel Supports"]
["B","Exteriors","Framer","Framing & Sheathing"]
["C","Exteriors","Exterior","EIFS"]
["D","Exteriors","Exterior","Window Installation"]
["E","Exteriors","Exterior","Final Caulking & Finishes"]
["F","Exteriors","Exterior","Shade Structure"]
[1,"Finishing Sitework","Sitework","Site Demoblization"]
[2,"Finishing Sitework","Electrical","UG Electrical"]
[3,"Finishing Sitework","Sitework","Rough Grading"]
[4,"Finishing Sitework","Sitework","Hardscaping"]
[5,"Finishing Sitework","Landscaping","Trees & Irrigation"]
[6,"Finishing Sitework","Landscaping","Landscaping"]
[7,"Finishing Sitework","Paving","Paving"]
[8,"Finishing Sitework","Sitework","Site Finishes"]